BDBM10468 US8846719, 295
SMILES: Cc1onc(c1COc1ccc(cn1)C(=O)NCCO)-c1ccc(F)cn1
InChI Key: InChIKey=BRFPNGGYSRUCIN-UHFFFAOYSA-N
Data: 1 KI
Activity Spreadsheet -- Enzyme Inhibition Constant Data from BindingDB
Found 1 hit for monomerid = 10468
Trg + Lig
Ki
nM
ΔG°
kcal/mole
IC50
nM
Kd
nM
EC50/IC50
nM
koff
s-1
kon
M-1s-1
pHTemp
°C
Gamma-aminobutyric acid receptor subunit alpha-5 (GABA(A))
(Homo sapiens (Human))
BDBM10468
(US8846719, 295)
Show SMILES Cc1onc(c1COc1ccc(cn1)C(=O)NCCO)-c1ccc(F)cn1
Show InChI InChI=1S/C18H17FN4O4/c1-11-14(17(23-27-11)15-4-3-13(19)9-21-15)10-26-16-5-2-12(8-22-16)18(25)20-6-7-24/h2-5,8-9,24H,6-7,10H2,1H3,(H,20,25)
Reactome pathway
US Patent
0.400 -11.9n/an/an/an/an/a7.54
Roche Palo Alto LLC
US Patent
Assay Description
Radioligand binding assays were carried out in a volume of 200 mL (96-well plates) which contained 100 mL of cell memebranes, [3H]flumazenil at a con...
US Patent US8846719 (2014)
BindingDB Entry DOI: 10.7270/Q2V986RV