BDBM104820 US8569314, 5
SMILES: CC1=C([N+]#[C-])C(c2ccc(cc2S(C)(=O)=O)C#N)n2nc(nc2N1c1cccc(c1)C(F)(F)F)N1C(=O)c2ccccc2C1=O
InChI Key: InChIKey=NPRNEDFKNLIKMN-UHFFFAOYSA-N
Data: 1 IC50
Activity Spreadsheet -- Enzyme Inhibition Constant Data from BindingDB
Found 1 hit for monomerid = 104820
Trg + Lig
Ki
nM
ΔG°
kcal/mole
IC50
nM
Kd
nM
EC50/IC50
nM
koff
s-1
kon
M-1s-1
pHTemp
°C
Leukocyte elastase
(Homo sapiens (Human))
BDBM104820
(US8569314, 5)
Show SMILES CC1=C([N+]#[C-])C(c2ccc(cc2S(C)(=O)=O)C#N)n2nc(nc2N1c1cccc(c1)C(F)(F)F)N1C(=O)c2ccccc2C1=O |c:1|
Show InChI InChI=1S/C30H18F3N7O4S/c1-16-24(35-2)25(22-12-11-17(15-34)13-23(22)45(3,43)44)40-29(38(16)19-8-6-7-18(14-19)30(31,32)33)36-28(37-40)39-26(41)20-9-4-5-10-21(20)27(39)42/h4-14,25H,1,3H3
Reactome pathway
US Patent
n/an/a<0.300n/an/an/an/an/an/a
Bayer Intellectual Property GmbH
US Patent
Assay Description
In vitro HNE inhibition assay. The potency of the compounds of the invention is ascertained in an in vitro inhibition assay. The HNE-mediated amido...
US Patent US8569314 (2013)
BindingDB Entry DOI: 10.7270/Q2FJ2FF4