BDBM10508 5-(1,2-dithiolan-3-yl)-N-[4-(1,2,3,4-tetrahydroacridin-9-ylamino)butyl]pentanamide::tacrine-lipoic acid hybrid 3
SMILES: O=C(CCCCC1CCSS1)NCCCCNc1c2CCCCc2nc2ccccc12
InChI Key: InChIKey=IEBFRRATFZBOGS-UHFFFAOYSA-N
Data: 2 IC50
Activity Spreadsheet -- Enzyme Inhibition Constant Data from BindingDB
Found 2 hits for monomerid = 10508
Trg + Lig
Ki
nM
ΔG°
kcal/mole
IC50
nM
Kd
nM
EC50/IC50
nM
koff
s-1
kon
M-1s-1
pHTemp
°C
Cholinesterases
(Homo sapiens (Human))
BDBM10508
(5-(1,2-dithiolan-3-yl)-N-[4-(1,2,3,4-tetrahydroacr...)
Show SMILES O=C(CCCCC1CCSS1)NCCCCNc1c2CCCCc2nc2ccccc12
Show InChI InChI=1S/C25H35N3OS2/c29-24(14-6-1-9-19-15-18-30-31-19)26-16-7-8-17-27-25-20-10-2-4-12-22(20)28-23-13-5-3-11-21(23)25/h2,4,10,12,19H,1,3,5-9,11,13-18H2,(H,26,29)(H,27,28)
Reactome pathway
n/an/a 5.04n/an/an/an/a8.037
University of Bologna
Assay Description
The cholinesterase assays were performed using colorimetric method reported by Ellman. Enzyme activity was determined by measuring the absorbance at...
J Med Chem 48: 360-3 (2005)
Article DOI: 10.1021/jm049112h
BindingDB Entry DOI: 10.7270/Q2JQ0Z7J
Acetylcholinesterase
(Homo sapiens (Human))
BDBM10508
(5-(1,2-dithiolan-3-yl)-N-[4-(1,2,3,4-tetrahydroacr...)
Show SMILES O=C(CCCCC1CCSS1)NCCCCNc1c2CCCCc2nc2ccccc12
Show InChI InChI=1S/C25H35N3OS2/c29-24(14-6-1-9-19-15-18-30-31-19)26-16-7-8-17-27-25-20-10-2-4-12-22(20)28-23-13-5-3-11-21(23)25/h2,4,10,12,19H,1,3,5-9,11,13-18H2,(H,26,29)(H,27,28)
NCI pathway
Reactome pathway
n/an/a 35.2n/an/an/an/a8.037
University of Bologna
Assay Description
The cholinesterase assays were performed using colorimetric method reported by Ellman. Enzyme activity was determined by measuring the absorbance at...
J Med Chem 48: 360-3 (2005)
Article DOI: 10.1021/jm049112h
BindingDB Entry DOI: 10.7270/Q2JQ0Z7J