BDBM105190 4-amino-3-bromopyridine
SMILES: Nc1ccncc1Br
InChI Key: InChIKey=DDQYSZWFFXOXER-UHFFFAOYSA-N
Data: 1 IC50
Activity Spreadsheet -- Enzyme Inhibition Constant Data from BindingDB
Found 1 hit for monomerid = 105190
Trg + Lig
Ki
nM
ΔG°
kcal/mole
IC50
nM
Kd
nM
EC50/IC50
nM
koff
s-1
kon
M-1s-1
pHTemp
°C
H1N1 Endonuclease
(2009 H1N1 Influenza)
BDBM105190
(4-amino-3-bromopyridine)
Show SMILES Nc1ccncc1Br
Show InChI InChI=1S/C5H5BrN2/c6-4-3-8-2-1-5(4)7/h1-3H,(H2,7,8)
n/an/a>1.00E+6n/an/an/an/an/an/a
Rutgers University
Assay Description
Cocktails of 4-8 compounds were used for the initial screening with single compound soaks to verify the bound fragment identity and to rule out coope...
ACS Chem Biol 8: 2501-8 (2013)
Article DOI: 10.1021/cb400400j
BindingDB Entry DOI: 10.7270/Q28W3BZW