BDBM105191 4-(1H-1,2,4-Triazol-1-yl)benzoic acid
SMILES: OC(=O)c1ccc(cc1)-n1cncn1
InChI Key: InChIKey=FOMQQGKCPYKKHQ-UHFFFAOYSA-N
Data: 1 IC50
PDB links: 1 PDB ID matches this monomer.
Activity Spreadsheet -- Enzyme Inhibition Constant Data from BindingDB
Found 1 hit for monomerid = 105191
Trg + Lig
Ki
nM
ΔG°
kcal/mole
IC50
nM
Kd
nM
EC50/IC50
nM
koff
s-1
kon
M-1s-1
pHTemp
°C
H1N1 Endonuclease
(2009 H1N1 Influenza)
BDBM105191
(4-(1H-1,2,4-Triazol-1-yl)benzoic acid)
Show SMILES OC(=O)c1ccc(cc1)-n1cncn1
Show InChI InChI=1S/C9H7N3O2/c13-9(14)7-1-3-8(4-2-7)12-6-10-5-11-12/h1-6H,(H,13,14)
n/an/a>1.00E+6n/an/an/an/an/an/a
Rutgers University
Assay Description
Cocktails of 4-8 compounds were used for the initial screening with single compound soaks to verify the bound fragment identity and to rule out coope...
ACS Chem Biol 8: 2501-8 (2013)
Article DOI: 10.1021/cb400400j
BindingDB Entry DOI: 10.7270/Q28W3BZW