BDBM105379 US8575203, I-125.21
SMILES: CN1CCC[C@@H](COc2ccnc3ccc(cc23)C#CCNC(=O)c2cccn(C(CO)c3cc(F)c(F)c(F)c3)c2=O)C1
InChI Key: InChIKey=MYBXLQXHKCSWGR-DMDVIOLWSA-N
Data: 1 IC50
Activity Spreadsheet -- Enzyme Inhibition Constant Data from BindingDB
Found 1 hit for monomerid = 105379
Trg + Lig
Ki
nM
ΔG°
kcal/mole
IC50
nM
Kd
nM
EC50/IC50
nM
koff
s-1
kon
M-1s-1
pHTemp
°C
3-phosphoinositide dependent protein kinase-1
(Homo sapiens (Human))
BDBM105379
(US8575203, I-125.21)
Show SMILES CN1CCC[C@@H](COc2ccnc3ccc(cc23)C#CCNC(=O)c2cccn(C(CO)c3cc(F)c(F)c(F)c3)c2=O)C1 |r|
Show InChI InChI=1S/C33H31F3N4O4/c1-39-13-3-6-22(18-39)20-44-30-10-12-37-28-9-8-21(15-25(28)30)5-2-11-38-32(42)24-7-4-14-40(33(24)43)29(19-41)23-16-26(34)31(36)27(35)17-23/h4,7-10,12,14-17,22,29,41H,3,6,11,13,18-20H2,1H3,(H,38,42)/t22-,29?/m1/s1
NCI pathway
Reactome pathway
US Patent
n/an/a 2n/an/an/an/an/an/a
Boehringer Ingelheim International GmbH
US Patent
Assay Description
The activity of the compounds according to the invention on the kinase PDK1 which inhibits the signal transduction pathway is determined in an in vit...
US Patent US8575203 (2013)
BindingDB Entry DOI: 10.7270/Q2HD7T91