BDBM106157 US9695174, 8
SMILES: COc1cc2[nH]c3[C@H](CC(C)C)N4[C@@H](Cc3c2cc1OC)C(=O)N[C@@H](C)C4=O
InChI Key:
Data: 3 IC50
Activity Spreadsheet -- Enzyme Inhibition Constant Data from BindingDB
Found 3 hits for monomerid = 106157
Trg + Lig
Ki
nM
ΔG°
kcal/mole
IC50
nM
Kd
nM
EC50/IC50
nM
koff
s-1
kon
M-1s-1
pHTemp
°C
ATP-binding cassette sub-family G member 2
(Homo sapiens (Human))
BDBM106157
(US9695174, 8)
Show SMILES COc1cc2[nH]c3[C@H](CC(C)C)N4[C@@H](Cc3c2cc1OC)C(=O)N[C@@H](C)C4=O |r|
NCI pathway
Reactome pathway
US Patent
n/an/a>1.00E+4n/an/an/an/a7.437
Millennium Pharmaceuticals, Inc.
US Patent
Assay Description
To determine potency of compounds on inhibition of transporters, bi-directional transport studies are performed in Caco-2 cells (American Type Cultur...
US Patent US9695174 (2017)
BindingDB Entry DOI: 10.7270/Q2DN436B
ATP-binding cassette sub-family G member 2
(Homo sapiens (Human))
BDBM106157
(US9695174, 8)
Show SMILES COc1cc2[nH]c3[C@H](CC(C)C)N4[C@@H](Cc3c2cc1OC)C(=O)N[C@@H](C)C4=O |r|
NCI pathway
Reactome pathway
n/an/a 1.70E+3n/an/an/an/an/an/a
Takeda Pharmaceuticals International Co.
Curated by ChEMBL
Assay Description
Inhibition of BCRP in human Caco2 cells using 3H-Estron-3-sulfate as substrate assessed as Ko143 IC50 measured at 30 to 120 mins by microplate scinti...
Bioorg Med Chem Lett 26: 551-555 (2016)
Article DOI: 10.1016/j.bmcl.2015.11.077
BindingDB Entry DOI: 10.7270/Q2HX1GPQ
ATP-binding cassette sub-family G member 2
(Homo sapiens (Human))
BDBM106157
(US9695174, 8)
Show SMILES COc1cc2[nH]c3[C@H](CC(C)C)N4[C@@H](Cc3c2cc1OC)C(=O)N[C@@H](C)C4=O |r|
NCI pathway
Reactome pathway
n/an/a>1.00E+4n/an/an/an/an/an/a
Takeda Pharmaceuticals International Co.
Curated by ChEMBL
Assay Description
Inhibition of BCRP in human Caco2 cells using 3H-Estron-3-sulfate as substrate measured at 30 to 120 mins by microplate scintillation and luminescenc...
Bioorg Med Chem Lett 26: 551-555 (2016)
Article DOI: 10.1016/j.bmcl.2015.11.077
BindingDB Entry DOI: 10.7270/Q2HX1GPQ