BDBM106687 US8586571, 50
SMILES: CC(C)(C)c1ccccc1OC1CCN(CC1)C(=O)c1ccccn1
InChI Key: InChIKey=SHJPHAPMYYIOPL-UHFFFAOYSA-N
Data: 1 IC50
Activity Spreadsheet -- Enzyme Inhibition Constant Data from BindingDB
Found 1 hit for monomerid = 106687
Trg + Lig
Ki
nM
ΔG°
kcal/mole
IC50
nM
Kd
nM
EC50/IC50
nM
koff
s-1
kon
M-1s-1
pHTemp
°C
Retinol-binding protein 4
(Homo sapiens (Human))
BDBM106687
(US8586571, 50)
Show SMILES CC(C)(C)c1ccccc1OC1CCN(CC1)C(=O)c1ccccn1
Show InChI InChI=1S/C21H26N2O2/c1-21(2,3)17-8-4-5-10-19(17)25-16-11-14-23(15-12-16)20(24)18-9-6-7-13-22-18/h4-10,13,16H,11-12,14-15H2,1-3H3
Reactome pathway
US Patent
n/an/a 5n/an/an/an/an/an/a
Takeda Pharmaceutical Company Limited
US Patent
Assay Description
The action of the compound of the present invention to inhibit binding of RBP4 and retinol and TTR was evaluated using the Retinol-RBP4-TTR ELISA (hu...
US Patent US8586571 (2013)
BindingDB Entry DOI: 10.7270/Q26W98QK