BDBM10673 US8846719, 289
SMILES: CC(C)NC(=O)c1ccc(OCc2c(C)onc2C2CCC(F)CN2)nc1
InChI Key: InChIKey=QOUJVWJBFJLZDL-UHFFFAOYSA-N
Data: 1 KI
Activity Spreadsheet -- Enzyme Inhibition Constant Data from BindingDB
Found 1 hit for monomerid = 10673
Trg + Lig
Ki
nM
ΔG°
kcal/mole
IC50
nM
Kd
nM
EC50/IC50
nM
koff
s-1
kon
M-1s-1
pHTemp
°C
Gamma-aminobutyric acid receptor subunit alpha-5 (GABA(A))
(Homo sapiens (Human))
BDBM10673
(US8846719, 289)
Show SMILES CC(C)NC(=O)c1ccc(OCc2c(C)onc2C2CCC(F)CN2)nc1
Show InChI InChI=1S/C19H25FN4O3/c1-11(2)23-19(25)13-4-7-17(22-8-13)26-10-15-12(3)27-24-18(15)16-6-5-14(20)9-21-16/h4,7-8,11,14,16,21H,5-6,9-10H2,1-3H3,(H,23,25)
Reactome pathway
US Patent
0.300 -12.1n/an/an/an/an/a7.54
Roche Palo Alto LLC
US Patent
Assay Description
Radioligand binding assays were carried out in a volume of 200 mL (96-well plates) which contained 100 mL of cell memebranes, [3H]flumazenil at a con...
US Patent US8846719 (2014)
BindingDB Entry DOI: 10.7270/Q2V986RV