BDBM107061 US8592432, 38
SMILES: COCCN1CCC(CC1)c1cc(OC(C)C)c(Nc2nc(Nc3ccccc3S(=O)(=O)C(C)C)c3c(C)[nH]nc3n2)cc1C
InChI Key: InChIKey=DLDMHQKDHQEYNJ-UHFFFAOYSA-N
Data: 1 IC50
Activity Spreadsheet -- Enzyme Inhibition Constant Data from BindingDB
Found 1 hit for monomerid = 107061
Trg + Lig
Ki
nM
ΔG°
kcal/mole
IC50
nM
Kd
nM
EC50/IC50
nM
koff
s-1
kon
M-1s-1
pHTemp
°C
ALK tyrosine kinase receptor
(Homo sapiens (Human))
BDBM107061
(US8592432, 38)
Show SMILES COCCN1CCC(CC1)c1cc(OC(C)C)c(Nc2nc(Nc3ccccc3S(=O)(=O)C(C)C)c3c(C)[nH]nc3n2)cc1C
Show InChI InChI=1S/C33H45N7O4S/c1-20(2)44-28-19-25(24-12-14-40(15-13-24)16-17-43-7)22(5)18-27(28)35-33-36-31(30-23(6)38-39-32(30)37-33)34-26-10-8-9-11-29(26)45(41,42)21(3)4/h8-11,18-21,24H,12-17H2,1-7H3,(H3,34,35,36,37,38,39)
US Patent
n/an/a 12n/an/an/an/an/an/a
TBA
US Patent
Assay Description
The inhibition of ALK tyrosine kinase activity may be demonstrated using known methods, for example using the recombinant kinase domain of the ALK in...
US Patent US8592432 (2013)
BindingDB Entry DOI: 10.7270/Q2J67FK9