BDBM107078 US8592432, 64
SMILES: COc1cc(C2CCOCC2)c(C)cc1Nc1nc(Nc2ccccc2S(=O)(=O)C(C)C)c2c(C)[nH]nc2n1
InChI Key: InChIKey=ZYJURKFHDLZIIB-UHFFFAOYSA-N
Data: 1 IC50
Activity Spreadsheet -- Enzyme Inhibition Constant Data from BindingDB
Found 1 hit for monomerid = 107078
Trg + Lig
Ki
nM
ΔG°
kcal/mole
IC50
nM
Kd
nM
EC50/IC50
nM
koff
s-1
kon
M-1s-1
pHTemp
°C
ALK tyrosine kinase receptor
(Homo sapiens (Human))
BDBM107078
(US8592432, 64)
Show SMILES COc1cc(C2CCOCC2)c(C)cc1Nc1nc(Nc2ccccc2S(=O)(=O)C(C)C)c2c(C)[nH]nc2n1
Show InChI InChI=1S/C28H34N6O4S/c1-16(2)39(35,36)24-9-7-6-8-21(24)29-26-25-18(4)33-34-27(25)32-28(31-26)30-22-14-17(3)20(15-23(22)37-5)19-10-12-38-13-11-19/h6-9,14-16,19H,10-13H2,1-5H3,(H3,29,30,31,32,33,34)
US Patent
n/an/a 6n/an/an/an/an/an/a
TBA
US Patent
Assay Description
The inhibition of ALK tyrosine kinase activity may be demonstrated using known methods, for example using the recombinant kinase domain of the ALK in...
US Patent US8592432 (2013)
BindingDB Entry DOI: 10.7270/Q2J67FK9