BDBM107189 US8592426, 38
SMILES: COc1cc(on1)C(=O)NC1(CC1)C(=O)NC1CCc2cc(cnc12)-c1cc(Cl)cc(F)c1-c1noc(C)n1
InChI Key: InChIKey=QDFIXHJNZHRIQL-UHFFFAOYSA-N
Data: 1 KI  1 IC50
Activity Spreadsheet -- Enzyme Inhibition Constant Data from BindingDB
Found 2 hits for monomerid = 107189
Trg + Lig
Ki
nM
ΔG°
kcal/mole
IC50
nM
Kd
nM
EC50/IC50
nM
koff
s-1
kon
M-1s-1
pHTemp
°C
Kininogen-1
(Homo sapiens (Human))
BDBM107189
(US8592426, 38)
Show SMILES COc1cc(on1)C(=O)NC1(CC1)C(=O)NC1CCc2cc(cnc12)-c1cc(Cl)cc(F)c1-c1noc(C)n1
Show InChI InChI=1S/C26H22ClFN6O5/c1-12-30-23(34-38-12)21-16(8-15(27)9-17(21)28)14-7-13-3-4-18(22(13)29-11-14)31-25(36)26(5-6-26)32-24(35)19-10-20(37-2)33-39-19/h7-11,18H,3-6H2,1-2H3,(H,31,36)(H,32,35)
Reactome pathway
US Patent
3n/an/an/an/an/an/an/an/a
Hoffmann—La Roche Inc.
US Patent
Assay Description
Binding assay using Bradykinin-1 receptor.
US Patent US8592426 (2013)
BindingDB Entry DOI: 10.7270/Q2WH2NN0
Kininogen-1
(Homo sapiens (Human))
BDBM107189
(US8592426, 38)
Show SMILES COc1cc(on1)C(=O)NC1(CC1)C(=O)NC1CCc2cc(cnc12)-c1cc(Cl)cc(F)c1-c1noc(C)n1
Show InChI InChI=1S/C26H22ClFN6O5/c1-12-30-23(34-38-12)21-16(8-15(27)9-17(21)28)14-7-13-3-4-18(22(13)29-11-14)31-25(36)26(5-6-26)32-24(35)19-10-20(37-2)33-39-19/h7-11,18H,3-6H2,1-2H3,(H,31,36)(H,32,35)
Reactome pathway
US Patent
n/an/a 0.200n/an/an/an/an/an/a
Hoffmann—La Roche Inc.
US Patent
Assay Description
Calcium mobilization assay using Bradykinin-1 receptor.
US Patent US8592426 (2013)
BindingDB Entry DOI: 10.7270/Q2WH2NN0