BDBM107203 US8592426, 53
SMILES: COc1cc(on1)C(=O)NC1(COC1)C(=O)N[C@H]1CCc2cc(ccc12)-c1cc(Cl)cc(F)c1-c1noc(C)n1
InChI Key: InChIKey=RYMCKAQYHQAPMB-FQEVSTJZSA-N
Data: 1 KI  1 IC50
Activity Spreadsheet -- Enzyme Inhibition Constant Data from BindingDB
Found 2 hits for monomerid = 107203
Trg + Lig
Ki
nM
ΔG°
kcal/mole
IC50
nM
Kd
nM
EC50/IC50
nM
koff
s-1
kon
M-1s-1
pHTemp
°C
Kininogen-1
(Homo sapiens (Human))
BDBM107203
(US8592426, 53)
Show SMILES COc1cc(on1)C(=O)NC1(COC1)C(=O)N[C@H]1CCc2cc(ccc12)-c1cc(Cl)cc(F)c1-c1noc(C)n1 |r|
Show InChI InChI=1S/C27H23ClFN5O6/c1-13-30-24(34-39-13)23-18(8-16(28)9-19(23)29)15-3-5-17-14(7-15)4-6-20(17)31-26(36)27(11-38-12-27)32-25(35)21-10-22(37-2)33-40-21/h3,5,7-10,20H,4,6,11-12H2,1-2H3,(H,31,36)(H,32,35)/t20-/m0/s1
Reactome pathway
US Patent
3.60n/an/an/an/an/an/an/an/a
Hoffmann—La Roche Inc.
US Patent
Assay Description
Binding assay using Bradykinin-1 receptor.
US Patent US8592426 (2013)
BindingDB Entry DOI: 10.7270/Q2WH2NN0
Kininogen-1
(Homo sapiens (Human))
BDBM107203
(US8592426, 53)
Show SMILES COc1cc(on1)C(=O)NC1(COC1)C(=O)N[C@H]1CCc2cc(ccc12)-c1cc(Cl)cc(F)c1-c1noc(C)n1 |r|
Show InChI InChI=1S/C27H23ClFN5O6/c1-13-30-24(34-39-13)23-18(8-16(28)9-19(23)29)15-3-5-17-14(7-15)4-6-20(17)31-26(36)27(11-38-12-27)32-25(35)21-10-22(37-2)33-40-21/h3,5,7-10,20H,4,6,11-12H2,1-2H3,(H,31,36)(H,32,35)/t20-/m0/s1
Reactome pathway
US Patent
n/an/a 0.400n/an/an/an/an/an/a
Hoffmann—La Roche Inc.
US Patent
Assay Description
Calcium mobilization assay using Bradykinin-1 receptor.
US Patent US8592426 (2013)
BindingDB Entry DOI: 10.7270/Q2WH2NN0