null
SMILES: Cn1nnc(n1)-c1c(F)cc(Cl)cc1-c1ccc2C(CSc2c1)NC(=O)C1(N)CC1
InChI Key: InChIKey=YCYBPINOGLKAOI-UHFFFAOYSA-N
Activity Spreadsheet -- Enzyme Inhibition Constant Data from BindingDB
Found 2 hits for monomerid = 107210
Trg + Lig
Ki
nM
ΔG°
kcal/mole
IC50
nM
Kd
nM
EC50/IC50
nM
koff
s-1
kon
M-1s-1
pHTemp
°C
Kininogen-1
(Homo sapiens (Human))
BDBM107210
(US8592426, 61)
Show SMILES Cn1nnc(n1)-c1c(F)cc(Cl)cc1-c1ccc2C(CSc2c1)NC(=O)C1(N)CC1
Show InChI InChI=1S/C20H18ClFN6OS/c1-28-26-18(25-27-28)17-13(7-11(21)8-14(17)22)10-2-3-12-15(9-30-16(12)6-10)24-19(29)20(23)4-5-20/h2-3,6-8,15H,4-5,9,23H2,1H3,(H,24,29)
Reactome pathway
US Patent
264n/an/an/an/an/an/an/an/a
Hoffmann—La Roche Inc.
US Patent
Assay Description
Binding assay using Bradykinin-1 receptor.
US Patent US8592426 (2013)
BindingDB Entry DOI: 10.7270/Q2WH2NN0
Kininogen-1
(Homo sapiens (Human))
BDBM107210
(US8592426, 61)
Show SMILES Cn1nnc(n1)-c1c(F)cc(Cl)cc1-c1ccc2C(CSc2c1)NC(=O)C1(N)CC1
Show InChI InChI=1S/C20H18ClFN6OS/c1-28-26-18(25-27-28)17-13(7-11(21)8-14(17)22)10-2-3-12-15(9-30-16(12)6-10)24-19(29)20(23)4-5-20/h2-3,6-8,15H,4-5,9,23H2,1H3,(H,24,29)
Reactome pathway
US Patent
n/an/a 17.4n/an/an/an/an/an/a
Hoffmann—La Roche Inc.
US Patent
Assay Description
Calcium mobilization assay using Bradykinin-1 receptor.
US Patent US8592426 (2013)
BindingDB Entry DOI: 10.7270/Q2WH2NN0