BDBM107419 US8592431, 296
SMILES: CCCc1c(Cc2ccc(cc2)-c2ccccc2-c2nc(=O)o[nH]2)c(=O)n([C@H]2CC[C@@H](CC2)OCC(C)(C)O)c2nc(C)nn12
InChI Key: InChIKey=XADUCCSKYZXXEX-SOAUALDESA-N
Data: 1 IC50
Activity Spreadsheet -- Enzyme Inhibition Constant Data from BindingDB
Found 1 hit for monomerid = 107419
Trg + Lig
Ki
nM
ΔG°
kcal/mole
IC50
nM
Kd
nM
EC50/IC50
nM
koff
s-1
kon
M-1s-1
pHTemp
°C
Acetyl-coenzyme A transporter 1 (AT1)
(Homo sapiens (Human))
BDBM107419
(US8592431, 296)
Show SMILES CCCc1c(Cc2ccc(cc2)-c2ccccc2-c2nc(=O)o[nH]2)c(=O)n([C@H]2CC[C@@H](CC2)OCC(C)(C)O)c2nc(C)nn12 |r,wU:27.29,wD:30.36,(-6.67,1.78,;-5.33,2.55,;-4,1.78,;-2.67,2.55,;-1.33,1.78,;-1.33,.24,;-2.67,-.53,;-2.67,-2.07,;-4,-2.84,;-5.33,-2.07,;-5.33,-.53,;-4,.24,;-6.67,-2.84,;-8,-2.07,;-9.34,-2.84,;-9.34,-4.38,;-8,-5.15,;-6.67,-4.38,;-5.33,-5.15,;-5.33,-6.69,;-3.87,-7.17,;-3.1,-8.5,;-2.96,-5.92,;-3.87,-4.68,;,2.55,;1.33,1.78,;,4.09,;1.33,4.86,;1.33,6.4,;2.67,7.17,;4,6.4,;4,4.86,;2.67,4.09,;5.33,7.17,;6.67,6.4,;8,7.17,;7.23,8.5,;8.77,8.5,;9.34,6.4,;-1.33,4.86,;-1.65,6.36,;-3.19,6.53,;-3.96,7.86,;-3.81,5.12,;-2.67,4.09,)|
Show InChI InChI=1S/C34H40N6O5/c1-5-8-29-28(19-22-11-13-23(14-12-22)26-9-6-7-10-27(26)30-36-33(42)45-38-30)31(41)39(32-35-21(2)37-40(29)32)24-15-17-25(18-16-24)44-20-34(3,4)43/h6-7,9-14,24-25,43H,5,8,15-20H2,1-4H3,(H,36,38,42)/t24-,25-
Reactome pathway
US Patent
n/an/a 1.70n/an/an/an/a7.4n/a
Takeda Pharmaceutical Company Limited
US Patent
Assay Description
The binding assay was performed using 22.5 pM [125I]-angiotensin II [manufactured by PerkinElmer, USA] (9 μg) in the presence of AT1 membrane an...
US Patent US8592431 (2013)
BindingDB Entry DOI: 10.7270/Q2H70DGX