BDBM107593 US8575157, 39
SMILES: C[C@H](N1CC[C@@](CCCNS(C)(=O)=O)(OC1=O)c1ccccc1)c1ccc(cc1)-c1ccc(=O)n(C)c1
InChI Key: InChIKey=YLYGOGOINFCFEB-RBTNQOKQSA-N
Data: 2 IC50
Activity Spreadsheet -- Enzyme Inhibition Constant Data from BindingDB
Found 2 hits for monomerid = 107593
Trg + Lig
Ki
nM
ΔG°
kcal/mole
IC50
nM
Kd
nM
EC50/IC50
nM
koff
s-1
kon
M-1s-1
pHTemp
°C
11-beta-hydroxysteroid dehydrogenase 1
(Homo sapiens (Human))
BDBM107593
(US8575157, 39)
Show SMILES C[C@H](N1CC[C@@](CCCNS(C)(=O)=O)(OC1=O)c1ccccc1)c1ccc(cc1)-c1ccc(=O)n(C)c1 |r|
Show InChI InChI=1S/C28H33N3O5S/c1-21(22-10-12-23(13-11-22)24-14-15-26(32)30(2)20-24)31-19-17-28(36-27(31)33,25-8-5-4-6-9-25)16-7-18-29-37(3,34)35/h4-6,8-15,20-21,29H,7,16-19H2,1-3H3/t21-,28+/m0/s1
Reactome pathway
US Patent
n/an/a 5.10n/an/an/an/an/an/a
Vitae Pharmaceuticals, Inc.; Boehringer Ingelheim International, GmbH
US Patent
Assay Description
Inhibition assay using 11β-HSD1 in the presence of 50% human plasma.
US Patent US8575157 (2013)
BindingDB Entry DOI: 10.7270/Q2416VPS
11-beta-hydroxysteroid dehydrogenase 1
(Homo sapiens (Human))
BDBM107593
(US8575157, 39)
Show SMILES C[C@H](N1CC[C@@](CCCNS(C)(=O)=O)(OC1=O)c1ccccc1)c1ccc(cc1)-c1ccc(=O)n(C)c1 |r|
Show InChI InChI=1S/C28H33N3O5S/c1-21(22-10-12-23(13-11-22)24-14-15-26(32)30(2)20-24)31-19-17-28(36-27(31)33,25-8-5-4-6-9-25)16-7-18-29-37(3,34)35/h4-6,8-15,20-21,29H,7,16-19H2,1-3H3/t21-,28+/m0/s1
Reactome pathway
US Patent
n/an/a 1.31n/an/an/an/an/an/a
Vitae Pharmaceuticals, Inc.; Boehringer Ingelheim International, GmbH
US Patent
Assay Description
The inhibition of a microsomal preparation of 11β-HSD1 by compounds of the invention was measured essentially as previously described (K. Solly,...
US Patent US8575157 (2013)
BindingDB Entry DOI: 10.7270/Q2416VPS