BDBM107616 US8575157, 66
SMILES: C[C@H](N1CC[C@@](CC(C)(C)O)(OC1=O)c1ccccc1)c1ccc(cc1)-c1ccn(CC(F)(F)F)c(=O)c1
InChI Key: InChIKey=VATASNGCLCGJEL-MMTVBGGISA-N
Data: 5 IC50
Activity Spreadsheet -- Enzyme Inhibition Constant Data from BindingDB
Found 5 hits for monomerid = 107616
Trg + Lig
Ki
nM
ΔG°
kcal/mole
IC50
nM
Kd
nM
EC50/IC50
nM
koff
s-1
kon
M-1s-1
pHTemp
°C
11-beta-hydroxysteroid dehydrogenase 1
(Homo sapiens (Human))
BDBM107616
(US8575157, 66)
Show SMILES C[C@H](N1CC[C@@](CC(C)(C)O)(OC1=O)c1ccccc1)c1ccc(cc1)-c1ccn(CC(F)(F)F)c(=O)c1 |r|
Show InChI InChI=1S/C29H31F3N2O4/c1-20(21-9-11-22(12-10-21)23-13-15-33(25(35)17-23)19-29(30,31)32)34-16-14-28(38-26(34)36,18-27(2,3)37)24-7-5-4-6-8-24/h4-13,15,17,20,37H,14,16,18-19H2,1-3H3/t20-,28-/m0/s1
Reactome pathway
US Patent
n/an/a 1.47n/an/an/an/an/an/a
Vitae Pharmaceuticals, Inc.; Boehringer Ingelheim International, GmbH
US Patent
Assay Description
The inhibition of a microsomal preparation of 11β-HSD1 by compounds of the invention was measured essentially as previously described (K. Solly,...
US Patent US8575157 (2013)
BindingDB Entry DOI: 10.7270/Q2416VPS
11-beta-hydroxysteroid dehydrogenase 1
(Homo sapiens (Human))
BDBM107616
(US8575157, 66)
Show SMILES C[C@H](N1CC[C@@](CC(C)(C)O)(OC1=O)c1ccccc1)c1ccc(cc1)-c1ccn(CC(F)(F)F)c(=O)c1 |r|
Show InChI InChI=1S/C29H31F3N2O4/c1-20(21-9-11-22(12-10-21)23-13-15-33(25(35)17-23)19-29(30,31)32)34-16-14-28(38-26(34)36,18-27(2,3)37)24-7-5-4-6-8-24/h4-13,15,17,20,37H,14,16,18-19H2,1-3H3/t20-,28-/m0/s1
Reactome pathway
US Patent
n/an/a 6.71n/an/an/an/an/an/a
Vitae Pharmaceuticals, Inc.; Boehringer Ingelheim International, GmbH
US Patent
Assay Description
Inhibition assay using 11β-HSD1 in the presence of 50% human plasma.
US Patent US8575157 (2013)
BindingDB Entry DOI: 10.7270/Q2416VPS
Cytochrome P450 2C19
(Homo sapiens (Human))
BDBM107616
(US8575157, 66)
Show SMILES C[C@H](N1CC[C@@](CC(C)(C)O)(OC1=O)c1ccccc1)c1ccc(cc1)-c1ccn(CC(F)(F)F)c(=O)c1 |r|
Show InChI InChI=1S/C29H31F3N2O4/c1-20(21-9-11-22(12-10-21)23-13-15-33(25(35)17-23)19-29(30,31)32)34-16-14-28(38-26(34)36,18-27(2,3)37)24-7-5-4-6-8-24/h4-13,15,17,20,37H,14,16,18-19H2,1-3H3/t20-,28-/m0/s1
Reactome pathway
US Patent
n/an/a 1.10E+4n/an/an/an/an/a37
Vitae Pharmaceuticals, Inc.; Boehringer Ingelheim International, GmbH
US Patent
Assay Description
Using a procedure similar to that described in Biological Test Example 6, the inhibition of cytochrome P450 2C19-isoenzyme catalysed N-demethylation ...
US Patent US8575157 (2013)
BindingDB Entry DOI: 10.7270/Q2416VPS
Cytochrome P450 2C9
(Homo sapiens (Human))
BDBM107616
(US8575157, 66)
Show SMILES C[C@H](N1CC[C@@](CC(C)(C)O)(OC1=O)c1ccccc1)c1ccc(cc1)-c1ccn(CC(F)(F)F)c(=O)c1 |r|
Show InChI InChI=1S/C29H31F3N2O4/c1-20(21-9-11-22(12-10-21)23-13-15-33(25(35)17-23)19-29(30,31)32)34-16-14-28(38-26(34)36,18-27(2,3)37)24-7-5-4-6-8-24/h4-13,15,17,20,37H,14,16,18-19H2,1-3H3/t20-,28-/m0/s1
Reactome pathway
US Patent
n/an/a 1.00E+4n/an/an/an/an/a37
Vitae Pharmaceuticals, Inc.; Boehringer Ingelheim International, GmbH
US Patent
Assay Description
Using a procedure similar to that described in Biological Test Example 6, the inhibition of cytochrome P450 2C9-isoenzyme catalysed O-demethylation o...
US Patent US8575157 (2013)
BindingDB Entry DOI: 10.7270/Q2416VPS
Cytochrome P450 3A4
(Homo sapiens (Human))
BDBM107616
(US8575157, 66)
Show SMILES C[C@H](N1CC[C@@](CC(C)(C)O)(OC1=O)c1ccccc1)c1ccc(cc1)-c1ccn(CC(F)(F)F)c(=O)c1 |r|
Show InChI InChI=1S/C29H31F3N2O4/c1-20(21-9-11-22(12-10-21)23-13-15-33(25(35)17-23)19-29(30,31)32)34-16-14-28(38-26(34)36,18-27(2,3)37)24-7-5-4-6-8-24/h4-13,15,17,20,37H,14,16,18-19H2,1-3H3/t20-,28-/m0/s1
Reactome pathway
US Patent
n/an/a 1.80E+4n/an/an/an/an/a37
Vitae Pharmaceuticals, Inc.; Boehringer Ingelheim International, GmbH
US Patent
Assay Description
The assay was based on a method published by Moody et al. (Xenobiotica 1999). The inhibition of cytochrome P450 3A4-isoenzyme catalysed N-demethylati...
US Patent US8575157 (2013)
BindingDB Entry DOI: 10.7270/Q2416VPS