BDBM107755 US8598217, 140
SMILES: CN(C)C1CCN(CC1)c1ccc2[nH]c(nc2n1)C(=O)c1ccc(C#N)c(c1)-c1cncc2[nH]ccc12
InChI Key: InChIKey=UBZILCZVFAKCSH-UHFFFAOYSA-N
Data: 1 IC50
Activity Spreadsheet -- Enzyme Inhibition Constant Data from BindingDB
Found 1 hit for monomerid = 107755
Trg + Lig
Ki
nM
ΔG°
kcal/mole
IC50
nM
Kd
nM
EC50/IC50
nM
koff
s-1
kon
M-1s-1
pHTemp
°C
Cyclin-dependent kinase 4 (CDK4)
(Oryctolagus cuniculus (Rabbit))
BDBM107755
(US8598217, 140)
Show SMILES CN(C)C1CCN(CC1)c1ccc2[nH]c(nc2n1)C(=O)c1ccc(C#N)c(c1)-c1cncc2[nH]ccc12
Show InChI InChI=1S/C28H26N8O/c1-35(2)19-8-11-36(12-9-19)25-6-5-23-27(33-25)34-28(32-23)26(37)17-3-4-18(14-29)21(13-17)22-15-30-16-24-20(22)7-10-31-24/h3-7,10,13,15-16,19,31H,8-9,11-12H2,1-2H3,(H,32,33,34)
US Patent
n/an/a 4n/an/an/an/a7.5n/a
Astex Therapeutics Ltd.; Novartis AG
US Patent
Assay Description
A 384-well microtiter Lance TR-FRET (time-resolved-fluorescence energy transfer) endpoint assay was used for CDK4/cyclin D1 kinase activity measureme...
US Patent US8598217 (2013)
BindingDB Entry DOI: 10.7270/Q2BG2MN8