BDBM108070 3‐amino‐1‐[(3Z)‐2‐oxo‐1H‐indol‐3‐ylidene]urea (Compound 10)
SMILES: NNC(=O)\N=C1/C(=O)Nc2ccccc12
InChI Key: InChIKey=HYOUODSLCVIIAR-UHFFFAOYSA-N
Data: 1 IC50
Activity Spreadsheet -- Enzyme Inhibition Constant Data from BindingDB
Found 1 hit for monomerid = 108070
Trg + Lig
Ki
nM
ΔG°
kcal/mole
IC50
nM
Kd
nM
EC50/IC50
nM
koff
s-1
kon
M-1s-1
pHTemp
°C
Chorismate mutase (MTB CM)
(Mycobacterium tuberculosis H37Rv)
BDBM108070
(3‐amino‐1‐[(3Z)‐2‐ox...)
Show SMILES NNC(=O)\N=C1/C(=O)Nc2ccccc12
Show InChI InChI=1S/C9H8N4O2/c10-13-9(15)12-7-5-3-1-2-4-6(5)11-8(7)14/h1-4H,10H2,(H2,11,12,13,14,15)
n/an/a 5.41E+4n/an/an/an/an/a37
Birla Institute of Technology & Science-Pilani, Hyderabad Campus, Shameerpet, R.R. District, Hyderabad, Andhra Pradesh, 500078, India
Assay Description
The reaction was initiated by the addition of 150pmoles of enzyme to a mixture of inhibitor (40µM, 20 µM, 10 µM, 5 µM, 1 µM ...
Chem Biol Drug Des 83: 498-506 (2014)
Article DOI: 10.1111/cbdd.12265
BindingDB Entry DOI: 10.7270/Q2F76B65