BDBM108075 (3Z)‐3‐(hydroxyimino)‐1H‐indol‐2‐one (Compound 15)
SMILES: O=NC1C(=O)Nc2ccccc12
InChI Key: InChIKey=ZOZQHKVBMVLWAJ-UHFFFAOYSA-N
Data: 1 IC50
Activity Spreadsheet -- Enzyme Inhibition Constant Data from BindingDB
Found 1 hit for monomerid = 108075
Trg + Lig
Ki
nM
ΔG°
kcal/mole
IC50
nM
Kd
nM
EC50/IC50
nM
koff
s-1
kon
M-1s-1
pHTemp
°C
Secreted chorismate mutase
(Mycobacterium tuberculosis H37Rv)
BDBM108075
((3Z)‐3‐(hydroxyimino)‐1H‐i...)
Show SMILES O=NC1C(=O)Nc2ccccc12
Show InChI InChI=1S/C8H6N2O2/c11-8-7(10-12)5-3-1-2-4-6(5)9-8/h1-4,7H,(H,9,11)
n/an/a 9.81E+4n/an/an/an/an/a37
Birla Institute of Technology & Science-Pilani, Hyderabad Campus, Shameerpet, R.R. District, Hyderabad, Andhra Pradesh, 500078, India
Assay Description
The reaction was initiated by the addition of 150pmoles of enzyme to a mixture of inhibitor (40µM, 20 µM, 10 µM, 5 µM, 1 µM ...
Chem Biol Drug Des 83: 498-506 (2014)
Article DOI: 10.1111/cbdd.12265
BindingDB Entry DOI: 10.7270/Q2F76B65