BDBM10842 3-(2-aminopyrimidin-4-yl)-7-bromo-1H-indol-4-ol::Meridianin E
SMILES: Nc1nccc(n1)-c1c[nH]c2c(Br)ccc(O)c12
InChI Key: InChIKey=USBKPWRTJAXTBS-UHFFFAOYSA-N
Data: 6 IC50
Activity Spreadsheet -- Enzyme Inhibition Constant Data from BindingDB
Found 6 hits for monomerid = 10842
Trg + Lig
Ki
nM
ΔG°
kcal/mole
IC50
nM
Kd
nM
EC50/IC50
nM
koff
s-1
kon
M-1s-1
pHTemp
°C
Cyclin-Dependent Kinase 1 (CDK1)
(Homo sapiens (Human))
BDBM10842
(3-(2-aminopyrimidin-4-yl)-7-bromo-1H-indol-4-ol | ...)
Show SMILES Nc1nccc(n1)-c1c[nH]c2c(Br)ccc(O)c12
Show InChI InChI=1S/C12H9BrN4O/c13-7-1-2-9(18)10-6(5-16-11(7)10)8-3-4-15-12(14)17-8/h1-5,16,18H,(H2,14,15,17)
Reactome pathway
n/an/a 180n/an/an/an/a7.230
CNRS
Assay Description
Kinase activities were assayed in buffers containing substrate, enzyme, and inhibitor at 30°C in the presence of 15 uM ATP/[gamma-32P] ATP. 32P ...
Bioorg Med Chem Lett 14: 1703-7 (2004)
Article DOI: 10.1016/j.bmcl.2004.01.050
BindingDB Entry DOI: 10.7270/Q2BZ648W
Cyclin-Dependent Kinase 5 (CDK5)
(Homo sapiens (Human))
BDBM10842
(3-(2-aminopyrimidin-4-yl)-7-bromo-1H-indol-4-ol | ...)
Show SMILES Nc1nccc(n1)-c1c[nH]c2c(Br)ccc(O)c12
Show InChI InChI=1S/C12H9BrN4O/c13-7-1-2-9(18)10-6(5-16-11(7)10)8-3-4-15-12(14)17-8/h1-5,16,18H,(H2,14,15,17)
NCI pathway
Reactome pathway
n/an/a 150n/an/an/an/an/a30
CNRS
Assay Description
Kinase activities were assayed in buffers containing substrate, enzyme, and inhibitor at 30°C in the presence of 15 uM ATP/[gamma-32P] ATP. 32P ...
Bioorg Med Chem Lett 14: 1703-7 (2004)
Article DOI: 10.1016/j.bmcl.2004.01.050
BindingDB Entry DOI: 10.7270/Q2BZ648W
Casein Kinase I
(Rattus norvegicus (rat))
BDBM10842
(3-(2-aminopyrimidin-4-yl)-7-bromo-1H-indol-4-ol | ...)
Show SMILES Nc1nccc(n1)-c1c[nH]c2c(Br)ccc(O)c12
Show InChI InChI=1S/C12H9BrN4O/c13-7-1-2-9(18)10-6(5-16-11(7)10)8-3-4-15-12(14)17-8/h1-5,16,18H,(H2,14,15,17)
n/an/a 400n/an/an/an/an/a30
CNRS
Assay Description
Kinase activities were assayed in buffers containing substrate, enzyme, and inhibitor at 30°C in the presence of 15 uM ATP/[gamma-32P] ATP. 32P ...
Bioorg Med Chem Lett 14: 1703-7 (2004)
Article DOI: 10.1016/j.bmcl.2004.01.050
BindingDB Entry DOI: 10.7270/Q2BZ648W
cGMP-Dependent Protein Kinase
(Bos taurus (bovine))
BDBM10842
(3-(2-aminopyrimidin-4-yl)-7-bromo-1H-indol-4-ol | ...)
Show SMILES Nc1nccc(n1)-c1c[nH]c2c(Br)ccc(O)c12
Show InChI InChI=1S/C12H9BrN4O/c13-7-1-2-9(18)10-6(5-16-11(7)10)8-3-4-15-12(14)17-8/h1-5,16,18H,(H2,14,15,17)
Reactome pathway
n/an/a 600n/an/an/an/an/a30
CNRS
Assay Description
Kinase activities were assayed in buffers containing substrate, enzyme, and inhibitor at 30°C in the presence of 15 uM ATP/[gamma-32P] ATP. 32P ...
Bioorg Med Chem Lett 14: 1703-7 (2004)
Article DOI: 10.1016/j.bmcl.2004.01.050
BindingDB Entry DOI: 10.7270/Q2BZ648W
Glycogen Synthase Kinase-3, beta
(Rattus norvegicus (rat))
BDBM10842
(3-(2-aminopyrimidin-4-yl)-7-bromo-1H-indol-4-ol | ...)
Show SMILES Nc1nccc(n1)-c1c[nH]c2c(Br)ccc(O)c12
Show InChI InChI=1S/C12H9BrN4O/c13-7-1-2-9(18)10-6(5-16-11(7)10)8-3-4-15-12(14)17-8/h1-5,16,18H,(H2,14,15,17)
Reactome pathway
n/an/a 2.50E+3n/an/an/an/an/a30
CNRS
Assay Description
Kinase activities were assayed in buffers containing substrate, enzyme, and inhibitor at 30°C in the presence of 15 uM ATP/[gamma-32P] ATP. 32P ...
Bioorg Med Chem Lett 14: 1703-7 (2004)
Article DOI: 10.1016/j.bmcl.2004.01.050
BindingDB Entry DOI: 10.7270/Q2BZ648W
cAMP-Dependent Protein Kinase (PKA)
(Bos taurus (bovine))
BDBM10842
(3-(2-aminopyrimidin-4-yl)-7-bromo-1H-indol-4-ol | ...)
Show SMILES Nc1nccc(n1)-c1c[nH]c2c(Br)ccc(O)c12
Show InChI InChI=1S/C12H9BrN4O/c13-7-1-2-9(18)10-6(5-16-11(7)10)8-3-4-15-12(14)17-8/h1-5,16,18H,(H2,14,15,17)
n/an/a 90n/an/an/an/an/a30
CNRS
Assay Description
Kinase activities were assayed in buffers containing substrate, enzyme, and inhibitor at 30°C in the presence of 15 uM ATP/[gamma-32P] ATP. 32P ...
Bioorg Med Chem Lett 14: 1703-7 (2004)
Article DOI: 10.1016/j.bmcl.2004.01.050
BindingDB Entry DOI: 10.7270/Q2BZ648W