BDBM108872 US8604016, 452::US9938267, Cmpd ID 452
SMILES: CS(=O)(=O)NCc1cccc(CC(=O)Nc2nnc(CCCCc3ccc(NC(=O)Cc4ccccc4)nn3)s2)c1
InChI Key: InChIKey=YHPLKZYZYCCCIQ-UHFFFAOYSA-N
Data: 2 IC50
Activity Spreadsheet -- Enzyme Inhibition Constant Data from BindingDB
Found 2 hits for monomerid = 108872
Trg + Lig
Ki
nM
ΔG°
kcal/mole
IC50
nM
Kd
nM
EC50/IC50
nM
koff
s-1
kon
M-1s-1
pHTemp
°C
Glutaminase kidney isoform, mitochondrial
(Homo sapiens (Human))
BDBM108872
(US8604016, 452 | US9938267, Cmpd ID 452)
Show SMILES CS(=O)(=O)NCc1cccc(CC(=O)Nc2nnc(CCCCc3ccc(NC(=O)Cc4ccccc4)nn3)s2)c1
Show InChI InChI=1S/C28H31N7O4S2/c1-41(38,39)29-19-22-11-7-10-21(16-22)18-26(37)31-28-35-34-27(40-28)13-6-5-12-23-14-15-24(33-32-23)30-25(36)17-20-8-3-2-4-9-20/h2-4,7-11,14-16,29H,5-6,12-13,17-19H2,1H3,(H,30,33,36)(H,31,35,37)
US Patent
n/an/a 4n/an/an/an/an/an/a
Amgen
Assay Description
Compounds were assessed for their ability to inhibit the enzymatic activity of a recombinant form of Glutaminase 1 (GAC) using a biochemical assay th...
J Med Chem 51: 1681-94 (2008)
BindingDB Entry DOI: 10.7270/Q2JS9SQV
Glutaminase kidney isoform, mitochondrial
(Homo sapiens (Human))
BDBM108872
(US8604016, 452 | US9938267, Cmpd ID 452)
Show SMILES CS(=O)(=O)NCc1cccc(CC(=O)Nc2nnc(CCCCc3ccc(NC(=O)Cc4ccccc4)nn3)s2)c1
Show InChI InChI=1S/C28H31N7O4S2/c1-41(38,39)29-19-22-11-7-10-21(16-22)18-26(37)31-28-35-34-27(40-28)13-6-5-12-23-14-15-24(33-32-23)30-25(36)17-20-8-3-2-4-9-20/h2-4,7-11,14-16,29H,5-6,12-13,17-19H2,1H3,(H,30,33,36)(H,31,35,37)
US Patent
n/an/a 4n/an/an/an/an/an/a
Calithera Biosciences Inc.
US Patent
Assay Description
Compounds were assessed for their ability to inhibit the enzymatic activity of a recombinant form of Glutaminase 1 (GAC) using a biochemical assay th...
US Patent US8604016 (2013)
BindingDB Entry DOI: 10.7270/Q2CC0ZBW