null
SMILES: CCCCN(C)C(=O)Cc1cccc(CC(=O)Nc2nnc(CCCCc3ccc(NC(=O)Cc4ccccc4)nn3)s2)c1
InChI Key: InChIKey=KGJQRCRWWHXVKJ-UHFFFAOYSA-N
Activity Spreadsheet -- Enzyme Inhibition Constant Data from BindingDB
Found 2 hits for monomerid = 108902
Trg + Lig
Ki
nM
ΔG°
kcal/mole
IC50
nM
Kd
nM
EC50/IC50
nM
koff
s-1
kon
M-1s-1
pHTemp
°C
Glutaminase kidney isoform, mitochondrial
(Homo sapiens (Human))
BDBM108902
(US8604016, 483 | US9938267, Cmpd ID 483)
Show SMILES CCCCN(C)C(=O)Cc1cccc(CC(=O)Nc2nnc(CCCCc3ccc(NC(=O)Cc4ccccc4)nn3)s2)c1
Show InChI InChI=1S/C33H39N7O3S/c1-3-4-19-40(2)32(43)23-26-14-10-13-25(20-26)22-30(42)35-33-39-38-31(44-33)16-9-8-15-27-17-18-28(37-36-27)34-29(41)21-24-11-6-5-7-12-24/h5-7,10-14,17-18,20H,3-4,8-9,15-16,19,21-23H2,1-2H3,(H,34,37,41)(H,35,39,42)
US Patent
n/an/a 4n/an/an/an/an/an/a
Amgen
Assay Description
Compounds were assessed for their ability to inhibit the enzymatic activity of a recombinant form of Glutaminase 1 (GAC) using a biochemical assay th...
J Med Chem 51: 1681-94 (2008)
BindingDB Entry DOI: 10.7270/Q2JS9SQV
Glutaminase kidney isoform, mitochondrial
(Homo sapiens (Human))
BDBM108902
(US8604016, 483 | US9938267, Cmpd ID 483)
Show SMILES CCCCN(C)C(=O)Cc1cccc(CC(=O)Nc2nnc(CCCCc3ccc(NC(=O)Cc4ccccc4)nn3)s2)c1
Show InChI InChI=1S/C33H39N7O3S/c1-3-4-19-40(2)32(43)23-26-14-10-13-25(20-26)22-30(42)35-33-39-38-31(44-33)16-9-8-15-27-17-18-28(37-36-27)34-29(41)21-24-11-6-5-7-12-24/h5-7,10-14,17-18,20H,3-4,8-9,15-16,19,21-23H2,1-2H3,(H,34,37,41)(H,35,39,42)
US Patent
n/an/a 4n/an/an/an/an/an/a
Calithera Biosciences Inc.
US Patent
Assay Description
Compounds were assessed for their ability to inhibit the enzymatic activity of a recombinant form of Glutaminase 1 (GAC) using a biochemical assay th...
US Patent US8604016 (2013)
BindingDB Entry DOI: 10.7270/Q2CC0ZBW