null
SMILES: CC(C)Oc1ccc(cn1)C#Cc1csc(C)n1
InChI Key: InChIKey=SVXRTYFBOFCWFK-UHFFFAOYSA-N
Activity Spreadsheet -- Enzyme Inhibition Constant Data from BindingDB
Found 1 hit for monomerid = 109119
Trg + Lig
Ki
nM
ΔG°
kcal/mole
IC50
nM
Kd
nM
EC50/IC50
nM
koff
s-1
kon
M-1s-1
pHTemp
°C
Metabotropic glutamate receptor 5
(Rattus norvegicus (Rat))
BDBM109119
(US8609852, 26)
Show SMILES CC(C)Oc1ccc(cn1)C#Cc1csc(C)n1
Show InChI InChI=1S/C14H14N2OS/c1-10(2)17-14-7-5-12(8-15-14)4-6-13-9-18-11(3)16-13/h5,7-10H,1-3H3
Reactome pathway
US Patent
2 -11.9n/an/an/an/an/an/a25
Merck Sharp & Dohme Corp.
US Patent
Assay Description
Binding assays were performed as described in Schaffhauser H, Richards J G, Cartmell J, Chaboz S, Kemp J A, Klingelschmidt A, Messer J, Stadler H, Wo...
US Patent US8609852 (2013)
BindingDB Entry DOI: 10.7270/Q27M06K3