BDBM109121 US8609852, 28
SMILES: Cc1nc(cs1)C#Cc1ccc(SC(C)(C)C)nc1
InChI Key: InChIKey=DYDYACKKQHEVPN-UHFFFAOYSA-N
Data: 1 KI
Activity Spreadsheet -- Enzyme Inhibition Constant Data from BindingDB
Found 1 hit for monomerid = 109121
Trg + Lig
Ki
nM
ΔG°
kcal/mole
IC50
nM
Kd
nM
EC50/IC50
nM
koff
s-1
kon
M-1s-1
pHTemp
°C
Metabotropic glutamate receptor
(Rattus norvegicus (Rat))
BDBM109121
(US8609852, 28)
Show SMILES Cc1nc(cs1)C#Cc1ccc(SC(C)(C)C)nc1
Show InChI InChI=1S/C15H16N2S2/c1-11-17-13(10-18-11)7-5-12-6-8-14(16-9-12)19-15(2,3)4/h6,8-10H,1-4H3
Reactome pathway
US Patent
0.900 -12.3n/an/an/an/an/an/a25
Merck Sharp & Dohme Corp.
US Patent
Assay Description
Binding assays were performed as described in Schaffhauser H, Richards J G, Cartmell J, Chaboz S, Kemp J A, Klingelschmidt A, Messer J, Stadler H, Wo...
US Patent US8609852 (2013)
BindingDB Entry DOI: 10.7270/Q27M06K3