BDBM109164 US8609852, 71
SMILES: COCc1ccccc1-c1ccc(c[nH+]1)C#Cc1csc(C)n1
InChI Key: InChIKey=PCPBBAXMWGOZJC-UHFFFAOYSA-O
Data: 1 KI
Activity Spreadsheet -- Enzyme Inhibition Constant Data from BindingDB
Found 1 hit for monomerid = 109164
Trg + Lig
Ki
nM
ΔG°
kcal/mole
IC50
nM
Kd
nM
EC50/IC50
nM
koff
s-1
kon
M-1s-1
pHTemp
°C
Metabotropic glutamate receptor 5
(Rattus norvegicus (Rat))
BDBM109164
(US8609852, 71)
Show SMILES COCc1ccccc1-c1ccc(c[nH+]1)C#Cc1csc(C)n1
Show InChI InChI=1S/C19H16N2OS/c1-14-21-17(13-23-14)9-7-15-8-10-19(20-11-15)18-6-4-3-5-16(18)12-22-2/h3-6,8,10-11,13H,12H2,1-2H3/p+1
Reactome pathway
US Patent
4.5 -11.4n/an/an/an/an/an/a25
Merck Sharp & Dohme Corp.
US Patent
Assay Description
Binding assays were performed as described in Schaffhauser H, Richards J G, Cartmell J, Chaboz S, Kemp J A, Klingelschmidt A, Messer J, Stadler H, Wo...
US Patent US8609852 (2013)
BindingDB Entry DOI: 10.7270/Q27M06K3