BDBM109274 US8609622, 1
SMILES: OC[C@]12CO[C@](O1)([C@H](O)[C@@H](O)[C@@H]2O)c1ccc(Cl)c(Cc2ccc(OCCOC3CC3)cc2)c1
InChI Key: InChIKey=VCZVXZUEEYJYLC-UBCNIHEASA-N
Data: 2 IC50
Activity Spreadsheet -- Enzyme Inhibition Constant Data from BindingDB
Found 2 hits for monomerid = 109274
Trg + Lig
Ki
nM
ΔG°
kcal/mole
IC50
nM
Kd
nM
EC50/IC50
nM
koff
s-1
kon
M-1s-1
pHTemp
°C
sodium-dependent glucose cotransporter 1 (SGLT1)
(Mus musculus (Mouse))
BDBM109274
(US8609622, 1)
Show SMILES OC[C@]12CO[C@](O1)([C@H](O)[C@@H](O)[C@@H]2O)c1ccc(Cl)c(Cc2ccc(OCCOC3CC3)cc2)c1 |r|
Show InChI InChI=1S/C25H29ClO8/c26-20-8-3-17(25-23(30)21(28)22(29)24(13-27,34-25)14-33-25)12-16(20)11-15-1-4-18(5-2-15)31-9-10-32-19-6-7-19/h1-5,8,12,19,21-23,27-30H,6-7,9-11,13-14H2/t21-,22-,23+,24+,25+/m0/s1
Reactome pathway
US Patent
n/an/a>2.00E+3n/an/an/an/an/an/a
Shanghai Hengrui Pharmaceutical Co., Ltd.; Jiangsu Hengrui Medicine Co., Ltd.
US Patent
Assay Description
Inhibitory activity of the compounds using SGLT1 and SGLT2.
US Patent US8609622 (2013)
BindingDB Entry DOI: 10.7270/Q2BC3X6H
sodium-dependent glucose cotransporter 2 (SGLT2)
(Mus musculus (Mouse))
BDBM109274
(US8609622, 1)
Show SMILES OC[C@]12CO[C@](O1)([C@H](O)[C@@H](O)[C@@H]2O)c1ccc(Cl)c(Cc2ccc(OCCOC3CC3)cc2)c1 |r|
Show InChI InChI=1S/C25H29ClO8/c26-20-8-3-17(25-23(30)21(28)22(29)24(13-27,34-25)14-33-25)12-16(20)11-15-1-4-18(5-2-15)31-9-10-32-19-6-7-19/h1-5,8,12,19,21-23,27-30H,6-7,9-11,13-14H2/t21-,22-,23+,24+,25+/m0/s1
Reactome pathway
US Patent
n/an/a 9.53n/an/an/an/an/an/a
Shanghai Hengrui Pharmaceutical Co., Ltd.; Jiangsu Hengrui Medicine Co., Ltd.
US Patent
Assay Description
Inhibitory activity of the compounds using SGLT1 and SGLT2.
US Patent US8609622 (2013)
BindingDB Entry DOI: 10.7270/Q2BC3X6H