BDBM109336 US8609666, 56
SMILES: CS(=O)(=O)c1cc(nc2c(nc(nc12)N1CCOCC1)-c1cc(O)cc(F)c1)C(O)=O
InChI Key: InChIKey=SQNAADFQKNRPSX-UHFFFAOYSA-N
Data: 1 IC50
Activity Spreadsheet -- Enzyme Inhibition Constant Data from BindingDB
Found 1 hit for monomerid = 109336
Trg + Lig
Ki
nM
ΔG°
kcal/mole
IC50
nM
Kd
nM
EC50/IC50
nM
koff
s-1
kon
M-1s-1
pHTemp
°C
Phosphatidylinositol 4,5-bisphosphate 3-kinase catalytic subunit alpha isoform
(Homo sapiens (Human))
BDBM109336
(US8609666, 56)
Show SMILES CS(=O)(=O)c1cc(nc2c(nc(nc12)N1CCOCC1)-c1cc(O)cc(F)c1)C(O)=O
Show InChI InChI=1S/C19H17FN4O6S/c1-31(28,29)14-9-13(18(26)27)21-17-15(10-6-11(20)8-12(25)7-10)22-19(23-16(14)17)24-2-4-30-5-3-24/h6-9,25H,2-5H2,1H3,(H,26,27)
NCI pathway
Reactome pathway
US Patent
n/an/a 15n/an/an/an/an/an/a
Merck Serono SA
US Patent
Assay Description
The efficacy of compounds of the invention in inhibiting the PI3K induced-lipid phosphorylation may be tested in the following binding assay. The ass...
US Patent US8609666 (2013)
BindingDB Entry DOI: 10.7270/Q26M35G5