null
SMILES: COc1cccc(n1)-c1cc(F)ccc1[C@H]1Cc2nc(N)nc(C)c2C(NOCC(CO)CO)=N1
InChI Key: InChIKey=UHHLIHNXTVZWCW-LJQANCHMSA-N
Activity Spreadsheet -- Enzyme Inhibition Constant Data from BindingDB
Found 1 hit for monomerid = 110217
Trg + Lig
Ki
nM
ΔG°
kcal/mole
IC50
nM
Kd
nM
EC50/IC50
nM
koff
s-1
kon
M-1s-1
pHTemp
°C
Heat shock protein HSP 90-alpha
(Homo sapiens (Human))
BDBM110217
(US8618290, 35)
Show SMILES COc1cccc(n1)-c1cc(F)ccc1[C@H]1Cc2nc(N)nc(C)c2C(NOCC(CO)CO)=N1 |r,c:36|
Show InChI InChI=1S/C24H27FN6O4/c1-13-22-20(30-24(26)27-13)9-19(29-23(22)31-35-12-14(10-32)11-33)16-7-6-15(25)8-17(16)18-4-3-5-21(28-18)34-2/h3-8,14,19,32-33H,9-12H2,1-2H3,(H,29,31)(H2,26,27,30)/t19-/m1/s1
NCI pathway
Reactome pathway
US Patent
n/an/a 13n/an/an/an/a7.3n/a
Takeda Pharmaceutical Company Limited
US Patent
Assay Description
An in vitro competition fluorescence polarization assay in which a test compound competes with a fluorescent probe for binding to the binding domain ...
US Patent US8618290 (2013)
BindingDB Entry DOI: 10.7270/Q2D50KM5