BDBM110223 US8618290, 61
SMILES: COc1cccc(n1)-c1cc(F)ccc1[C@H]1Cc2nc(N)nc(C)c2C(NO)=N1
InChI Key: InChIKey=QQZSVQVISZJSQY-OAHLLOKOSA-N
Data: 1 IC50
Activity Spreadsheet -- Enzyme Inhibition Constant Data from BindingDB
Found 1 hit for monomerid = 110223
Trg + Lig
Ki
nM
ΔG°
kcal/mole
IC50
nM
Kd
nM
EC50/IC50
nM
koff
s-1
kon
M-1s-1
pHTemp
°C
Heat shock protein HSP 90-alpha
(Homo sapiens (Human))
BDBM110223
(US8618290, 61)
Show SMILES COc1cccc(n1)-c1cc(F)ccc1[C@H]1Cc2nc(N)nc(C)c2C(NO)=N1 |r,c:30|
Show InChI InChI=1S/C20H19FN6O2/c1-10-18-16(26-20(22)23-10)9-15(25-19(18)27-28)12-7-6-11(21)8-13(12)14-4-3-5-17(24-14)29-2/h3-8,15,28H,9H2,1-2H3,(H,25,27)(H2,22,23,26)/t15-/m1/s1
NCI pathway
Reactome pathway
US Patent
n/an/a 3n/an/an/an/a7.3n/a
Takeda Pharmaceutical Company Limited
US Patent
Assay Description
An in vitro competition fluorescence polarization assay in which a test compound competes with a fluorescent probe for binding to the binding domain ...
US Patent US8618290 (2013)
BindingDB Entry DOI: 10.7270/Q2D50KM5