null
SMILES: CN1CCCC[C@@H]1C(=O)N[C@@H](C1CCCCC1)C(=O)N[C@H](C(=O)N1C[C@]2(C[C@H]1C(=O)N[C@@]1(C[C@H]1C=C)C(=O)NS(=O)(=O)N1CCCC1)C(C)(C)C21CCC1)C(C)(C)C
InChI Key: InChIKey=KNQHCQDUNTWSPH-NEJAIESCSA-N
Activity Spreadsheet -- Enzyme Inhibition Constant Data from BindingDB
Found 2 hits for monomerid = 110280
Trg + Lig
Ki
nM
ΔG°
kcal/mole
IC50
nM
Kd
nM
EC50/IC50
nM
koff
s-1
kon
M-1s-1
pHTemp
°C
Genome polyprotein
(Hepatitis C virus (HCV genotype 1a, isolate H))
BDBM110280
(US8613914, 48 | US9206232, 48)
Show SMILES CN1CCCC[C@@H]1C(=O)N[C@@H](C1CCCCC1)C(=O)N[C@H](C(=O)N1C[C@]2(C[C@H]1C(=O)N[C@@]1(C[C@H]1C=C)C(=O)NS(=O)(=O)N1CCCC1)C(C)(C)C21CCC1)C(C)(C)C |r|
Show InChI InChI=1S/C43H69N7O7S/c1-8-29-25-43(29,38(55)47-58(56,57)49-23-14-15-24-49)46-35(52)31-26-42(40(5,6)41(42)20-16-21-41)27-50(31)37(54)33(39(2,3)4)45-36(53)32(28-17-10-9-11-18-28)44-34(51)30-19-12-13-22-48(30)7/h8,28-33H,1,9-27H2,2-7H3,(H,44,51)(H,45,53)(H,46,52)(H,47,55)/t29-,30-,31+,32+,33-,42-,43-/m1/s1
US Patent
n/an/a 0.900n/an/an/an/an/an/a
Novartis AG
US Patent
Assay Description
The inhibitory activity of certain compounds of Table A against HCV NS3-4A serine protease is determined in a homogenous assay using the full-length ...
US Patent US9206232 (2015)
BindingDB Entry DOI: 10.7270/Q2M0447H
Genome polyprotein
(Hepatitis C virus)
BDBM110280
(US8613914, 48 | US9206232, 48)
Show SMILES CN1CCCC[C@@H]1C(=O)N[C@@H](C1CCCCC1)C(=O)N[C@H](C(=O)N1C[C@]2(C[C@H]1C(=O)N[C@@]1(C[C@H]1C=C)C(=O)NS(=O)(=O)N1CCCC1)C(C)(C)C21CCC1)C(C)(C)C |r|
Show InChI InChI=1S/C43H69N7O7S/c1-8-29-25-43(29,38(55)47-58(56,57)49-23-14-15-24-49)46-35(52)31-26-42(40(5,6)41(42)20-16-21-41)27-50(31)37(54)33(39(2,3)4)45-36(53)32(28-17-10-9-11-18-28)44-34(51)30-19-12-13-22-48(30)7/h8,28-33H,1,9-27H2,2-7H3,(H,44,51)(H,45,53)(H,46,52)(H,47,55)/t29-,30-,31+,32+,33-,42-,43-/m1/s1
US Patent
n/an/a 0.900n/an/an/an/an/an/a
Novartis AG
US Patent
Assay Description
The inhibitory activity of certain compounds against HCV NS3-4A serine protease is determined in a homogenous assay using the full-length NS3-4A prot...
US Patent US8613914 (2013)
BindingDB Entry DOI: 10.7270/Q28C9TWW