BDBM110295 US8613914, 63::US9206232, 63
SMILES: CCN(CC)S(=O)(=O)NC(=O)[C@]1(C[C@H]1C=C)NC(=O)[C@@H]1C[C@@]2(CN1C(=O)[C@@H](NC(=O)[C@@H](NC(=O)[C@@H]1CCCN1CC)C1CCCCC1)C(C)(C)C)C(C)(C)C21CCC1
InChI Key: InChIKey=XLLUDKOBZFHIKN-ZPWJQIKTSA-N
Data: 2 IC50
Activity Spreadsheet -- Enzyme Inhibition Constant Data from BindingDB
Found 2 hits for monomerid = 110295
Trg + Lig
Ki
nM
ΔG°
kcal/mole
IC50
nM
Kd
nM
EC50/IC50
nM
koff
s-1
kon
M-1s-1
pHTemp
°C
HCV NS3-NS4A Serine Proteinase
(Hepatitis C virus (HCV genotype 1a, isolate H))
BDBM110295
(US8613914, 63 | US9206232, 63)
Show SMILES CCN(CC)S(=O)(=O)NC(=O)[C@]1(C[C@H]1C=C)NC(=O)[C@@H]1C[C@@]2(CN1C(=O)[C@@H](NC(=O)[C@@H](NC(=O)[C@@H]1CCCN1CC)C1CCCCC1)C(C)(C)C)C(C)(C)C21CCC1 |r|
Show InChI InChI=1S/C43H71N7O7S/c1-10-29-25-43(29,38(55)47-58(56,57)49(12-3)13-4)46-35(52)31-26-42(40(8,9)41(42)22-18-23-41)27-50(31)37(54)33(39(5,6)7)45-36(53)32(28-19-15-14-16-20-28)44-34(51)30-21-17-24-48(30)11-2/h10,28-33H,1,11-27H2,2-9H3,(H,44,51)(H,45,53)(H,46,52)(H,47,55)/t29-,30+,31+,32+,33-,42-,43-/m1/s1
US Patent
n/an/a 1.20n/an/an/an/an/an/a
Novartis AG
US Patent
Assay Description
The inhibitory activity of certain compounds of Table A against HCV NS3-4A serine protease is determined in a homogenous assay using the full-length ...
US Patent US9206232 (2015)
BindingDB Entry DOI: 10.7270/Q2M0447H
NS3/4A protein
(Hepatitis C virus)
BDBM110295
(US8613914, 63 | US9206232, 63)
Show SMILES CCN(CC)S(=O)(=O)NC(=O)[C@]1(C[C@H]1C=C)NC(=O)[C@@H]1C[C@@]2(CN1C(=O)[C@@H](NC(=O)[C@@H](NC(=O)[C@@H]1CCCN1CC)C1CCCCC1)C(C)(C)C)C(C)(C)C21CCC1 |r|
Show InChI InChI=1S/C43H71N7O7S/c1-10-29-25-43(29,38(55)47-58(56,57)49(12-3)13-4)46-35(52)31-26-42(40(8,9)41(42)22-18-23-41)27-50(31)37(54)33(39(5,6)7)45-36(53)32(28-19-15-14-16-20-28)44-34(51)30-21-17-24-48(30)11-2/h10,28-33H,1,11-27H2,2-9H3,(H,44,51)(H,45,53)(H,46,52)(H,47,55)/t29-,30+,31+,32+,33-,42-,43-/m1/s1
US Patent
n/an/a 1.20n/an/an/an/an/an/a
Novartis AG
US Patent
Assay Description
The inhibitory activity of certain compounds against HCV NS3-4A serine protease is determined in a homogenous assay using the full-length NS3-4A prot...
US Patent US8613914 (2013)
BindingDB Entry DOI: 10.7270/Q28C9TWW