BDBM110451 US8614215, 23
SMILES: COc1ccc(CC2CCC(O)CC2)c(Nc2nc3ccccc3nc2NS(=O)(=O)c2cccnc2)c1
InChI Key: InChIKey=YGANNBJQBWSQPB-UHFFFAOYSA-N
Data: 1 IC50
Activity Spreadsheet -- Enzyme Inhibition Constant Data from BindingDB
Found 1 hit for monomerid = 110451
Trg + Lig
Ki
nM
ΔG°
kcal/mole
IC50
nM
Kd
nM
EC50/IC50
nM
koff
s-1
kon
M-1s-1
pHTemp
°C
Phosphatidylinositol 4,5-bisphosphate 3-kinase catalytic subunit gamma isoform
(Homo sapiens (Human))
BDBM110451
(US8614215, 23)
Show SMILES COc1ccc(CC2CCC(O)CC2)c(Nc2nc3ccccc3nc2NS(=O)(=O)c2cccnc2)c1 |(-3.33,7.7,;-3.33,6.16,;-2,5.39,;-.67,6.16,;.67,5.39,;.67,3.85,;2,3.08,;3.33,3.85,;4.67,3.08,;6,3.85,;6,5.39,;7.34,6.16,;4.67,6.16,;3.33,5.39,;-.67,3.08,;-.67,1.54,;-2,.77,;-3.33,1.54,;-4.67,.77,;-6,1.54,;-7.34,.77,;-7.34,-.77,;-6,-1.54,;-4.67,-.77,;-3.33,-1.54,;-2,-.77,;-.67,-1.54,;-.67,-3.08,;.87,-3.08,;-2.21,-3.08,;-.67,-4.62,;-2,-5.39,;-2,-6.93,;-.67,-7.7,;.67,-6.93,;.67,-5.39,;-2,3.85,)|
Show InChI InChI=1S/C27H29N5O4S/c1-36-21-13-10-19(15-18-8-11-20(33)12-9-18)25(16-21)31-26-27(30-24-7-3-2-6-23(24)29-26)32-37(34,35)22-5-4-14-28-17-22/h2-7,10,13-14,16-18,20,33H,8-9,11-12,15H2,1H3,(H,29,31)(H,30,32)
NCI pathway
Reactome pathway
US Patent
n/an/a 20n/an/an/an/an/an/a
Merck Serono SA
US Patent
Assay Description
The assay combines the scintillation proximity assay technology (SPA, Amersham) with the capacity of neomycin (a polycationic antibiotic) to bind pho...
US Patent US8614215 (2013)
BindingDB Entry DOI: 10.7270/Q24M936D