BDBM11062 (2S)-1-{[(2S,5S)-5-ethenylpyrrolidin-2-yl]carbonyl}pyrrolidine-2-carbonitrile::2-cyanopyrrolidine 10f
SMILES: C=C[C@@H]1CC[C@H](N1)C(=O)N1CCC[C@H]1C#N
InChI Key: InChIKey=VBZXBTXZTPKZQC-VWYCJHECSA-N
Data: 1 KI
Activity Spreadsheet -- Enzyme Inhibition Constant Data from BindingDB
Found 1 hit for monomerid = 11062
Trg + Lig
Ki
nM
ΔG°
kcal/mole
IC50
nM
Kd
nM
EC50/IC50
nM
koff
s-1
kon
M-1s-1
pHTemp
°C
Dipeptidyl peptidase 4
(Homo sapiens (Human))
BDBM11062
((2S)-1-{[(2S,5S)-5-ethenylpyrrolidin-2-yl]carbonyl...)
Show SMILES C=C[C@@H]1CC[C@H](N1)C(=O)N1CCC[C@H]1C#N |r|
Show InChI InChI=1S/C12H17N3O/c1-2-9-5-6-11(14-9)12(16)15-7-3-4-10(15)8-13/h2,9-11,14H,1,3-7H2/t9-,10+,11+/m1/s1
Reactome pathway
143 -9.24n/an/an/an/an/a7.522
Abbott Laboratories
Assay Description
The DPP4 activity resulted in the formation of the fluorescent product amidomethylcoumarin (AMC), which was monitored by excitation at 355 nm and mea...
J Med Chem 49: 3520-35 (2006)
Article DOI: 10.1021/jm051283e
BindingDB Entry DOI: 10.7270/Q2WS8RG1