BDBM110798 US8614206, 347
SMILES: Cn1ncc(NC(=O)c2nc(sc2N)-c2c(F)ccc(I)c2F)c1N1CC[C@H](N)CC(F)(F)C1
InChI Key: InChIKey=BDJVNOCAYKIQQF-VIFPVBQESA-N
Data: 1 KI
Activity Spreadsheet -- Enzyme Inhibition Constant Data from BindingDB
Found 1 hit for monomerid = 110798
Trg + Lig
Ki
nM
ΔG°
kcal/mole
IC50
nM
Kd
nM
EC50/IC50
nM
koff
s-1
kon
M-1s-1
pHTemp
°C
Serine/threonine-protein kinase pim-1
(Homo sapiens (Human))
BDBM110798
(US8614206, 347)
Show SMILES Cn1ncc(NC(=O)c2nc(sc2N)-c2c(F)ccc(I)c2F)c1N1CC[C@H](N)CC(F)(F)C1 |r|
Show InChI InChI=1S/C20H20F4IN7OS/c1-31-19(32-5-4-9(26)6-20(23,24)8-32)12(7-28-31)29-17(33)15-16(27)34-18(30-15)13-10(21)2-3-11(25)14(13)22/h2-3,7,9H,4-6,8,26-27H2,1H3,(H,29,33)/t9-/m0/s1
US Patent
0.00200n/an/an/an/an/an/a7.2n/a
F. Hoffmann-La Roche AG
US Patent
Assay Description
PIM-1, -2, and -3 enzymes were generated as fusion proteins expressed in bacteria and purified by IMAC column chromatography (Sun, X., Chiu, J. F., a...
US Patent US8614206 (2013)
BindingDB Entry DOI: 10.7270/Q2W66JFG