BDBM110900 US8614206, 453
SMILES: CC1CC(N)CCN(C1)c1c(NC(=O)c2nc(sc2N)-c2c(F)cccc2F)cnn1C
InChI Key: InChIKey=JYVGBPLDRFXMJS-UHFFFAOYSA-N
Data: 1 KI
Activity Spreadsheet -- Enzyme Inhibition Constant Data from BindingDB
Found 1 hit for monomerid = 110900
Trg + Lig
Ki
nM
ΔG°
kcal/mole
IC50
nM
Kd
nM
EC50/IC50
nM
koff
s-1
kon
M-1s-1
pHTemp
°C
Serine/threonine-protein kinase pim-1
(Homo sapiens (Human))
BDBM110900
(US8614206, 453)
Show SMILES CC1CC(N)CCN(C1)c1c(NC(=O)c2nc(sc2N)-c2c(F)cccc2F)cnn1C
Show InChI InChI=1S/C21H25F2N7OS/c1-11-8-12(24)6-7-30(10-11)21-15(9-26-29(21)2)27-19(31)17-18(25)32-20(28-17)16-13(22)4-3-5-14(16)23/h3-5,9,11-12H,6-8,10,24-25H2,1-2H3,(H,27,31)
US Patent
0.0120n/an/an/an/an/an/a7.2n/a
F. Hoffmann-La Roche AG
US Patent
Assay Description
PIM-1, -2, and -3 enzymes were generated as fusion proteins expressed in bacteria and purified by IMAC column chromatography (Sun, X., Chiu, J. F., a...
US Patent US8614206 (2013)
BindingDB Entry DOI: 10.7270/Q2W66JFG