BDBM110902 US8614206, 455
SMILES: Cn1ncc(NC(=O)c2nc(sc2N)-c2c(F)cncc2F)c1N1CC[C@@H](N)CC(F)(F)C1
InChI Key: InChIKey=PPNNWQOQDKJGHV-SECBINFHSA-N
Data: 1 KI
Activity Spreadsheet -- Enzyme Inhibition Constant Data from BindingDB
Found 1 hit for monomerid = 110902
Trg + Lig
Ki
nM
ΔG°
kcal/mole
IC50
nM
Kd
nM
EC50/IC50
nM
koff
s-1
kon
M-1s-1
pHTemp
°C
Serine/threonine-protein kinase pim-1
(Homo sapiens (Human))
BDBM110902
(US8614206, 455)
Show SMILES Cn1ncc(NC(=O)c2nc(sc2N)-c2c(F)cncc2F)c1N1CC[C@@H](N)CC(F)(F)C1 |r|
Show InChI InChI=1S/C19H20F4N8OS/c1-30-18(31-3-2-9(24)4-19(22,23)8-31)12(7-27-30)28-16(32)14-15(25)33-17(29-14)13-10(20)5-26-6-11(13)21/h5-7,9H,2-4,8,24-25H2,1H3,(H,28,32)/t9-/m1/s1
US Patent
0.00900n/an/an/an/an/an/a7.2n/a
F. Hoffmann-La Roche AG
US Patent
Assay Description
PIM-1, -2, and -3 enzymes were generated as fusion proteins expressed in bacteria and purified by IMAC column chromatography (Sun, X., Chiu, J. F., a...
US Patent US8614206 (2013)
BindingDB Entry DOI: 10.7270/Q2W66JFG