BDBM110906 US8614206, 459
SMILES: COc1cc(F)c(-c2nc(C(=O)Nc3cnn(C)c3N3CCC(N)CC(F)(F)C3)c(N)s2)c(F)c1
InChI Key: InChIKey=RKILTOKSEYVWBA-UHFFFAOYSA-N
Data: 1 KI
Activity Spreadsheet -- Enzyme Inhibition Constant Data from BindingDB
Found 1 hit for monomerid = 110906
Trg + Lig
Ki
nM
ΔG°
kcal/mole
IC50
nM
Kd
nM
EC50/IC50
nM
koff
s-1
kon
M-1s-1
pHTemp
°C
Serine/threonine-protein kinase pim-1
(Homo sapiens (Human))
BDBM110906
(US8614206, 459)
Show SMILES COc1cc(F)c(-c2nc(C(=O)Nc3cnn(C)c3N3CCC(N)CC(F)(F)C3)c(N)s2)c(F)c1
Show InChI InChI=1S/C21H23F4N7O2S/c1-31-20(32-4-3-10(26)7-21(24,25)9-32)14(8-28-31)29-18(33)16-17(27)35-19(30-16)15-12(22)5-11(34-2)6-13(15)23/h5-6,8,10H,3-4,7,9,26-27H2,1-2H3,(H,29,33)
US Patent
0.00600n/an/an/an/an/an/a7.2n/a
F. Hoffmann-La Roche AG
US Patent
Assay Description
PIM-1, -2, and -3 enzymes were generated as fusion proteins expressed in bacteria and purified by IMAC column chromatography (Sun, X., Chiu, J. F., a...
US Patent US8614206 (2013)
BindingDB Entry DOI: 10.7270/Q2W66JFG