BDBM1110 (4R,5R,6R)-1,3-bis[(3-amino-1H-indazol-5-yl)methyl]-4-benzyl-5-hydroxy-6-(2-phenylethyl)-1,3-diazinan-2-one::(4R,5R,6R)-Tetrahydro-5-hydroxy-1,3-bis[(3-amino-1H-indazol-5-yl)methyl]-4-(2-phenylethyl)-6-(phenylmethyl)-2(1H)-pyrimidinone::Tetrahydropyrimidinone deriv. 71
SMILES: Nc1n[nH]c2ccc(CN3[C@H](CCc4ccccc4)[C@@H](O)[C@@H](Cc4ccccc4)N(Cc4ccc5[nH]nc(N)c5c4)C3=O)cc12
InChI Key: InChIKey=IWRWYUHCNLAARG-XWHIBYANSA-N
Data: 3 KI
Activity Spreadsheet -- Enzyme Inhibition Constant Data from BindingDB
Found 3 hits for monomerid = 1110
Trg + Lig
Ki
nM
ΔG°
kcal/mole
IC50
nM
Kd
nM
EC50/IC50
nM
koff
s-1
kon
M-1s-1
pHTemp
°C
HIV-1 Protease
(Human immunodeficiency virus type 1)
BDBM1110
((4R,5R,6R)-1,3-bis[(3-amino-1H-indazol-5-yl)methyl...)
Show SMILES Nc1n[nH]c2ccc(CN3[C@H](CCc4ccccc4)[C@@H](O)[C@@H](Cc4ccccc4)N(Cc4ccc5[nH]nc(N)c5c4)C3=O)cc12 |r|
Show InChI InChI=1S/C35H36N8O2/c36-33-26-17-24(11-14-28(26)38-40-33)20-42-30(16-13-22-7-3-1-4-8-22)32(44)31(19-23-9-5-2-6-10-23)43(35(42)45)21-25-12-15-29-27(18-25)34(37)41-39-29/h1-12,14-15,17-18,30-32,44H,13,16,19-21H2,(H3,36,38,40)(H3,37,39,41)/t30-,31-,32-/m1/s1
0.0300 -14.9n/an/an/an/an/a5.537
DuPont Pharmaceuticals Company
Assay Description
Inhibition of HIV protease was measured by assay of the cleavage of a fluorescent peptide substrate. The fluorescent product (2-aminobenzoyl-Ala-Thr-...
J Med Chem 42: 135-52 (1999)
Article DOI: 10.1021/jm9803626
BindingDB Entry DOI: 10.7270/Q28050S9
Human immunodeficiency virus type 1 protease
(Human immunodeficiency virus type 1)
BDBM1110
((4R,5R,6R)-1,3-bis[(3-amino-1H-indazol-5-yl)methyl...)
Show SMILES Nc1n[nH]c2ccc(CN3[C@H](CCc4ccccc4)[C@@H](O)[C@@H](Cc4ccccc4)N(Cc4ccc5[nH]nc(N)c5c4)C3=O)cc12 |r|
Show InChI InChI=1S/C35H36N8O2/c36-33-26-17-24(11-14-28(26)38-40-33)20-42-30(16-13-22-7-3-1-4-8-22)32(44)31(19-23-9-5-2-6-10-23)43(35(42)45)21-25-12-15-29-27(18-25)34(37)41-39-29/h1-12,14-15,17-18,30-32,44H,13,16,19-21H2,(H3,36,38,40)(H3,37,39,41)/t30-,31-,32-/m1/s1
0.0300n/an/an/an/an/an/an/an/a
DuPont Pharmaceuticals Company
Assay Description
Inhibition constant of HIV protease inhibitors
J Med Chem 42: 135-52 (1999)
Article DOI: 10.1021/jm9803626
BindingDB Entry DOI: 10.7270/Q28050S9
Human immunodeficiency virus type 1 protease
(Human immunodeficiency virus type 1)
BDBM1110
((4R,5R,6R)-1,3-bis[(3-amino-1H-indazol-5-yl)methyl...)
Show SMILES Nc1n[nH]c2ccc(CN3[C@H](CCc4ccccc4)[C@@H](O)[C@@H](Cc4ccccc4)N(Cc4ccc5[nH]nc(N)c5c4)C3=O)cc12 |r|
Show InChI InChI=1S/C35H36N8O2/c36-33-26-17-24(11-14-28(26)38-40-33)20-42-30(16-13-22-7-3-1-4-8-22)32(44)31(19-23-9-5-2-6-10-23)43(35(42)45)21-25-12-15-29-27(18-25)34(37)41-39-29/h1-12,14-15,17-18,30-32,44H,13,16,19-21H2,(H3,36,38,40)(H3,37,39,41)/t30-,31-,32-/m1/s1
0.0301n/an/an/an/an/an/an/an/a
University of Florida
Curated by ChEMBL
Assay Description
Inhibitory activity of compound against HIV-1 aspartyl protease.
Bioorg Med Chem Lett 12: 3453-7 (2002)
BindingDB Entry DOI: 10.7270/Q2B27WG3