BDBM11129 (2S)-2-amino-1-(2,2-dimethyl-1,3-oxazolidin-3-yl)-3-(4-phenylphenyl)propan-1-one::4-phenylphenylalaninyl proline mimetic 16
SMILES: CC1(C)OCCN1C(=O)[C@@H](N)Cc1ccc(cc1)-c1ccccc1
InChI Key: InChIKey=IZGKGABELDQRQG-SFHVURJKSA-N
Data: 1 KI
Activity Spreadsheet -- Enzyme Inhibition Constant Data from BindingDB
Found 1 hit for monomerid = 11129
Trg + Lig
Ki
nM
ΔG°
kcal/mole
IC50
nM
Kd
nM
EC50/IC50
nM
koff
s-1
kon
M-1s-1
pHTemp
°C
Dipeptidyl peptidase 4
(Homo sapiens (Human))
BDBM11129
((2S)-2-amino-1-(2,2-dimethyl-1,3-oxazolidin-3-yl)-...)
Show SMILES CC1(C)OCCN1C(=O)[C@@H](N)Cc1ccc(cc1)-c1ccccc1 |r|
Show InChI InChI=1S/C20H24N2O2/c1-20(2)22(12-13-24-20)19(23)18(21)14-15-8-10-17(11-9-15)16-6-4-3-5-7-16/h3-11,18H,12-14,21H2,1-2H3/t18-/m0/s1
Reactome pathway
>1.28E+4>-6.67n/an/an/an/an/a7.425
Johnson & Johnson Pharmaceutical
Assay Description
The progress of DPPIV inhibition by compounds was measured by recording the liberation of free pNA at 405 nm. IC50 was determined from the slope of r...
Bioorg Med Chem Lett 16: 123-8 (2006)
Article DOI: 10.1016/j.bmcl.2005.09.037
BindingDB Entry DOI: 10.7270/Q2S180QJ