BDBM111618 US8618111, B-5
SMILES: Cc1ncnc(N2CCN(CC2)C2CC2)c1C#Cc1ccc(N)nc1
InChI Key: InChIKey=XZOWNDNQXMUCOC-UHFFFAOYSA-N
Data: 2 IC50
Activity Spreadsheet -- Enzyme Inhibition Constant Data from BindingDB
Found 2 hits for monomerid = 111618
Trg + Lig
Ki
nM
ΔG°
kcal/mole
IC50
nM
Kd
nM
EC50/IC50
nM
koff
s-1
kon
M-1s-1
pHTemp
°C
Serine/threonine-protein kinase mTOR
(Homo sapiens (Human))
BDBM111618
(US8618111, B-5)
Show SMILES Cc1ncnc(N2CCN(CC2)C2CC2)c1C#Cc1ccc(N)nc1
Show InChI InChI=1S/C19H22N6/c1-14-17(6-2-15-3-7-18(20)21-12-15)19(23-13-22-14)25-10-8-24(9-11-25)16-4-5-16/h3,7,12-13,16H,4-5,8-11H2,1H3,(H2,20,21)
NCI pathway
Reactome pathway
US Patent
n/an/a 10n/an/an/an/a7.525
Boehringer Ingelheim International GmbH
US Patent
Assay Description
The mTOR kinase TR-FRET assay utilizes a physiologically relevant protein substrate for mTOR (4E-BP1, labeled with an acceptor fluorophore (Green Flu...
US Patent US8618111 (2013)
BindingDB Entry DOI: 10.7270/Q2FX7838
Phosphatidylinositol 4,5-bisphosphate 3-kinase catalytic subunit alpha isoform
(Homo sapiens (Human))
BDBM111618
(US8618111, B-5)
Show SMILES Cc1ncnc(N2CCN(CC2)C2CC2)c1C#Cc1ccc(N)nc1
Show InChI InChI=1S/C19H22N6/c1-14-17(6-2-15-3-7-18(20)21-12-15)19(23-13-22-14)25-10-8-24(9-11-25)16-4-5-16/h3,7,12-13,16H,4-5,8-11H2,1H3,(H2,20,21)
NCI pathway
Reactome pathway
US Patent
n/an/a 58n/an/an/an/a7.50
Boehringer Ingelheim International GmbH
US Patent
Assay Description
PI3Kalpha assay described herein provides IC50 values indicating the activity of the compounds inhibiting PI3 kinase alpha activity Inhibition of PI3...
US Patent US8618111 (2013)
BindingDB Entry DOI: 10.7270/Q2FX7838