null
SMILES: FC(F)(F)c1ccc(c(Cc2nc3n(ncc3c(=O)[nH]2)C2CCOCC2)c1)-n1cccn1
InChI Key: InChIKey=DKGXBMGHVFVBEI-UHFFFAOYSA-N
Activity Spreadsheet -- Enzyme Inhibition Constant Data from BindingDB
Found 1 hit for monomerid = 111929
Trg + Lig
Ki
nM
ΔG°
kcal/mole
IC50
nM
Kd
nM
EC50/IC50
nM
koff
s-1
kon
M-1s-1
pHTemp
°C
High affinity cGMP-specific 3',5'-cyclic phosphodiesterase 9A
(Homo sapiens (Human))
BDBM111929
(US8623901, 257)
Show SMILES FC(F)(F)c1ccc(c(Cc2nc3n(ncc3c(=O)[nH]2)C2CCOCC2)c1)-n1cccn1
Show InChI InChI=1S/C21H19F3N6O2/c22-21(23,24)14-2-3-17(29-7-1-6-25-29)13(10-14)11-18-27-19-16(20(31)28-18)12-26-30(19)15-4-8-32-9-5-15/h1-3,6-7,10,12,15H,4-5,8-9,11H2,(H,27,28,31)
US Patent
n/an/a 31n/an/an/an/a7.50
Boehringer Ingelheim International GmbH
US Patent
Assay Description
The PDE9A2 enzymatic activity assay was run as scintillation proximity assay (SPA), in general according to the protocol of the manufacturer (GE Heal...
US Patent US8623901 (2014)
BindingDB Entry DOI: 10.7270/Q2Z036TP