null
SMILES: Cc1ccn(n1)-c1ccc(Cl)cc1Cc1nc2n(ncc2c(=O)[nH]1)C1CCOCC1
InChI Key: InChIKey=OWZZHBITXHRPKA-UHFFFAOYSA-N
Activity Spreadsheet -- Enzyme Inhibition Constant Data from BindingDB
Found 1 hit for monomerid = 111930
Trg + Lig
Ki
nM
ΔG°
kcal/mole
IC50
nM
Kd
nM
EC50/IC50
nM
koff
s-1
kon
M-1s-1
pHTemp
°C
High affinity cGMP-specific 3',5'-cyclic phosphodiesterase 9A
(Homo sapiens (Human))
BDBM111930
(US8623901, 258)
Show SMILES Cc1ccn(n1)-c1ccc(Cl)cc1Cc1nc2n(ncc2c(=O)[nH]1)C1CCOCC1
Show InChI InChI=1S/C21H21ClN6O2/c1-13-4-7-27(26-13)18-3-2-15(22)10-14(18)11-19-24-20-17(21(29)25-19)12-23-28(20)16-5-8-30-9-6-16/h2-4,7,10,12,16H,5-6,8-9,11H2,1H3,(H,24,25,29)
US Patent
n/an/a 7n/an/an/an/a7.50
Boehringer Ingelheim International GmbH
US Patent
Assay Description
The PDE9A2 enzymatic activity assay was run as scintillation proximity assay (SPA), in general according to the protocol of the manufacturer (GE Heal...
US Patent US8623901 (2014)
BindingDB Entry DOI: 10.7270/Q2Z036TP