BDBM11266 N-(4-chlorophenyl)-2-({4-[4-methyl-5-(4-methyl-1,3-thiazol-2-yl)-2-(methylsulfanyl)thiophen-3-yl]pyrimidin-2-yl}sulfanyl)acetamide::pyrimidine-containing compound 3
SMILES: CSc1sc(c(C)c1-c1ccnc(SCC(=O)Nc2ccc(Cl)cc2)n1)-c1nc(C)cs1
InChI Key: InChIKey=WRXXISITJDZVCL-UHFFFAOYSA-N
Data: 1 IC50
Activity Spreadsheet -- Enzyme Inhibition Constant Data from BindingDB
Found 2 hits for monomerid = 11266
Trg + Lig
Ki
nM
ΔG°
kcal/mole
IC50
nM
Kd
nM
EC50/IC50
nM
koff
s-1
kon
M-1s-1
pHTemp
°C
3C-like proteinase (3CL-PRO)
(Human SARS coronavirus (SARS-CoV) (Severe acute re...)
BDBM11266
(N-(4-chlorophenyl)-2-({4-[4-methyl-5-(4-methyl-1,3...)
Show SMILES CSc1sc(c(C)c1-c1ccnc(SCC(=O)Nc2ccc(Cl)cc2)n1)-c1nc(C)cs1
Show InChI InChI=1S/C22H19ClN4OS4/c1-12-10-30-20(25-12)19-13(2)18(21(29-3)32-19)16-8-9-24-22(27-16)31-11-17(28)26-15-6-4-14(23)5-7-15/h4-10H,11H2,1-3H3,(H,26,28)
n/an/a 1.10E+4n/an/an/an/an/an/a
TBA
Citation and Details
3C-like proteinase (3CL-PRO)
(Human SARS coronavirus (SARS-CoV) (Severe acute re...)
BDBM11266
(N-(4-chlorophenyl)-2-({4-[4-methyl-5-(4-methyl-1,3...)
Show SMILES CSc1sc(c(C)c1-c1ccnc(SCC(=O)Nc2ccc(Cl)cc2)n1)-c1nc(C)cs1
Show InChI InChI=1S/C22H19ClN4OS4/c1-12-10-30-20(25-12)19-13(2)18(21(29-3)32-19)16-8-9-24-22(27-16)31-11-17(28)26-15-6-4-14(23)5-7-15/h4-10H,11H2,1-3H3,(H,26,28)
n/an/a 1.10E+4n/an/an/an/a7.025
National Tsing Hua University
Assay Description
The effects of compound on enzyme activity were measured by using a fluorogenic peptide cleavage assay. Enhanced fluorescence caused by cleavage of t...
J Med Chem 49: 3485-95 (2006)
Article DOI: 10.1021/jm050852f
BindingDB Entry DOI: 10.7270/Q2R20ZKB