null
SMILES: CS(=O)(=O)Oc1cccc(CCC(=O)Nc2ccc(CCNN)cc2)c1
InChI Key: InChIKey=IBBSOYMJISIARL-UHFFFAOYSA-N
Activity Spreadsheet -- Enzyme Inhibition Constant Data from BindingDB
Found 1 hit for monomerid = 113749
Trg + Lig
Ki
nM
ΔG°
kcal/mole
IC50
nM
Kd
nM
EC50/IC50
nM
koff
s-1
kon
M-1s-1
pHTemp
°C
Lysine-specific histone demethylase 1A
(Homo sapiens (Human))
BDBM113749
(3-(3-{[4-(2-Hydrazinylethyl)phenyl]amino}-3-oxopro...)
Show SMILES CS(=O)(=O)Oc1cccc(CCC(=O)Nc2ccc(CCNN)cc2)c1
Show InChI InChI=1S/C18H23N3O4S/c1-26(23,24)25-17-4-2-3-15(13-17)7-10-18(22)21-16-8-5-14(6-9-16)11-12-20-19/h2-6,8-9,13,20H,7,10-12,19H2,1H3,(H,21,22)
Reactome pathway
223n/an/an/an/an/an/a7.5n/a
Johns Hopkins University School of Medicine , Baltimore, Maryland 21205, United States
Assay Description
Reactions (100 µL) were initiated by the addition of 2 µL of GST-LSD1 (final concentration 96-154 nM). The reaction mixture contained 50 mM...
ACS Chem Biol 9: 1284-93 (2014)
Article DOI: 10.1021/cb500018s
BindingDB Entry DOI: 10.7270/Q2FN14VF