BDBM113781 2-(4-Chloro-2-fluorophenyl)-2-(6-chloropyridin-2-yl) acetonitrile (13)
SMILES: Fc1cc(Cl)ccc1C(C#N)c1cccc(Cl)n1
InChI Key: InChIKey=AIDQZABXXMIHQX-UHFFFAOYSA-N
Data: 1 IC50
Activity Spreadsheet -- Enzyme Inhibition Constant Data from BindingDB
Found 1 hit for monomerid = 113781
Trg + Lig
Ki
nM
ΔG°
kcal/mole
IC50
nM
Kd
nM
EC50/IC50
nM
koff
s-1
kon
M-1s-1
pHTemp
°C
Acyl-homoserine lactone acylase PvdQ [A190E,F674L]
(Pseudomonas aeruginosa)
BDBM113781
(2-(4-Chloro-2-fluorophenyl)-2-(6-chloropyridin-2-y...)
Show SMILES Fc1cc(Cl)ccc1C(C#N)c1cccc(Cl)n1
Show InChI InChI=1S/C13H7Cl2FN2/c14-8-4-5-9(11(16)6-8)10(7-17)12-2-1-3-13(15)18-12/h1-6,10H
n/an/a 60n/an/an/an/an/an/a
The Broad Institute , Cambridge, Massachusetts 02142, United States
Assay Description
The assay was performed with nine compound concentrations that ranged from 3 nM to 19.5 µM with PvdQ concentration of 20 nM. The positive contro...
ACS Chem Biol 9: 1536-44 (2014)
Article DOI: 10.1021/cb5001586
BindingDB Entry DOI: 10.7270/Q2PC311M