BDBM113783 2-(4-Chlorophenyl)-2-(3-chloropyridin-2-yl) acetonitrile (15)
SMILES: Clc1ccc(cc1)C(C#N)c1ncccc1Cl
InChI Key: InChIKey=MFBOMJOABQXCFN-UHFFFAOYSA-N
Data: 1 IC50
Activity Spreadsheet -- Enzyme Inhibition Constant Data from BindingDB
Found 1 hit for monomerid = 113783
Trg + Lig
Ki
nM
ΔG°
kcal/mole
IC50
nM
Kd
nM
EC50/IC50
nM
koff
s-1
kon
M-1s-1
pHTemp
°C
Acyl-homoserine lactone acylase PvdQ [A190E,F674L]
(Pseudomonas aeruginosa)
BDBM113783
(2-(4-Chlorophenyl)-2-(3-chloropyridin-2-yl) aceton...)
Show SMILES Clc1ccc(cc1)C(C#N)c1ncccc1Cl
Show InChI InChI=1S/C13H8Cl2N2/c14-10-5-3-9(4-6-10)11(8-16)13-12(15)2-1-7-17-13/h1-7,11H
n/an/a 10n/an/an/an/an/an/a
The Broad Institute , Cambridge, Massachusetts 02142, United States
Assay Description
The assay was performed with nine compound concentrations that ranged from 3 nM to 19.5 µM with PvdQ concentration of 20 nM. The positive contro...
ACS Chem Biol 9: 1536-44 (2014)
Article DOI: 10.1021/cb5001586
BindingDB Entry DOI: 10.7270/Q2PC311M