BDBM114395 7,11b-dihydro-6H-indeno[2,1-c][1]benzopyran-3,4,6a,9,10-pentol::7,11b-dihydro-6H-indeno[2,1-c]chromene-3,4,6a,9,10-pentol::MLS000876743::SMR000440556::cid_10603
SMILES: Oc1ccc2C3c4cc(O)c(O)cc4CC3(O)COc2c1O
InChI Key: InChIKey=WZUVPPKBWHMQCE-UHFFFAOYSA-N
Data: 3 IC50
Activity Spreadsheet -- Enzyme Inhibition Constant Data from BindingDB
Found 3 hits for monomerid = 114395
Trg + Lig
Ki
nM
ΔG°
kcal/mole
IC50
nM
Kd
nM
EC50/IC50
nM
koff
s-1
kon
M-1s-1
pHTemp
°C
Prion protein
(Homo sapiens (Human))
BDBM114395
(7,11b-dihydro-6H-indeno[2,1-c][1]benzopyran-3,4,6a...)
Show SMILES Oc1ccc2C3c4cc(O)c(O)cc4CC3(O)COc2c1O
Show InChI InChI=1S/C16H14O6/c17-10-2-1-8-13-9-4-12(19)11(18)3-7(9)5-16(13,21)6-22-15(8)14(10)20/h1-4,13,17-21H,5-6H2
NCI pathway
Reactome pathway
PCBioAssay
n/an/a 1.40E+4n/an/an/an/an/an/a
The Scripps Research Institute Molecular Screening Center
Curated by PubChem BioAssay
Assay Description
Source (MLPCN Center Name): The Scripps Research Institute Molecular Screening Center (SRIMSC) Affiliation: The Scripps Research Institute, TSRI Assa...
PubChem Bioassay (2014)
BindingDB Entry DOI: 10.7270/Q2HM573M
Chain E, Fragment Double-D From Human Fibrin
(Homo sapiens (Human))
BDBM114395
(7,11b-dihydro-6H-indeno[2,1-c][1]benzopyran-3,4,6a...)
Show SMILES Oc1ccc2C3c4cc(O)c(O)cc4CC3(O)COc2c1O
Show InChI InChI=1S/C16H14O6/c17-10-2-1-8-13-9-4-12(19)11(18)3-7(9)5-16(13,21)6-22-15(8)14(10)20/h1-4,13,17-21H,5-6H2
Reactome pathway
PCBioAssay
n/an/a 8.33E+4n/an/an/an/an/an/a
The Scripps Research Institute Molecular Screening Center
Curated by PubChem BioAssay
Assay Description
Source (MLPCN Center Name): The Scripps Research Institute Molecular Screening Center (SRIMSC) Center Affiliation: Harvard Medical School/Massachuset...
PubChem Bioassay (2013)
BindingDB Entry DOI: 10.7270/Q2R49PFB
Chain E, Fragment Double-D From Human Fibrin
(Homo sapiens (Human))
BDBM114395
(7,11b-dihydro-6H-indeno[2,1-c][1]benzopyran-3,4,6a...)
Show SMILES Oc1ccc2C3c4cc(O)c(O)cc4CC3(O)COc2c1O
Show InChI InChI=1S/C16H14O6/c17-10-2-1-8-13-9-4-12(19)11(18)3-7(9)5-16(13,21)6-22-15(8)14(10)20/h1-4,13,17-21H,5-6H2
Reactome pathway
PCBioAssay
n/an/a 9.33E+3n/an/an/an/an/an/a
The Scripps Research Institute Molecular Screening Center
Curated by PubChem BioAssay
Assay Description
Source (MLPCN Center Name): The Scripps Research Institute Molecular Screening Center (SRIMSC) Center Affiliation: Harvard Medical School/Massachuset...
PubChem Bioassay (2013)
BindingDB Entry DOI: 10.7270/Q2VX0F59