BDBM114974 MLS000102772::N-[(3-methyl-6-imidazo[2,1-b]thiazolyl)methyl]-1-propanesulfonamide::N-[(3-methylimidazo[2,1-b][1,3]thiazol-6-yl)methyl]propane-1-sulfonamide::N-[(3-methylimidazo[2,1-b]thiazol-6-yl)methyl]propane-1-sulfonamide::SMR000018213::cid_5310488
SMILES: CCCS(=O)(=O)NCc1cn2c(C)csc2n1
InChI Key: InChIKey=KKSHWAITTSRIHM-UHFFFAOYSA-N
Data: 1 EC50
Activity Spreadsheet -- Enzyme Inhibition Constant Data from BindingDB
Found 1 hit for monomerid = 114974
Trg + Lig
Ki
nM
ΔG°
kcal/mole
IC50
nM
Kd
nM
EC50/IC50
nM
koff
s-1
kon
M-1s-1
pHTemp
°C
Oxysterols receptor LXR-beta
(Homo sapiens (Human))
BDBM114974
(MLS000102772 | N-[(3-methyl-6-imidazo[2,1-b]thiazo...)
Show SMILES CCCS(=O)(=O)NCc1cn2c(C)csc2n1
Show InChI InChI=1S/C10H15N3O2S2/c1-3-4-17(14,15)11-5-9-6-13-8(2)7-16-10(13)12-9/h6-7,11H,3-5H2,1-2H3
PCBioAssay
n/an/an/an/a 6.75E+4n/an/an/an/a
The Scripps Research Institute Molecular Screening Center
Curated by PubChem BioAssay
Assay Description
Source (MLPCN Center Name): The Scripps Research Institute Molecular Screening Center Affiliation: UT Southwestern Assay Provider: David Mangelsdorf,...
PubChem Bioassay (2013)
BindingDB Entry DOI: 10.7270/Q2ZP44SP