null
SMILES: Cc1cc2nc([nH]c2cc1C)-c1cccnc1SCC(=O)NCc1ccco1
InChI Key: InChIKey=BFJFBFZUMCMFKG-UHFFFAOYSA-N
Activity Spreadsheet -- Enzyme Inhibition Constant Data from BindingDB
Found 1 hit for monomerid = 115071
Trg + Lig
Ki
nM
ΔG°
kcal/mole
IC50
nM
Kd
nM
EC50/IC50
nM
koff
s-1
kon
M-1s-1
pHTemp
°C
Oxysterols receptor LXR-beta
(Homo sapiens (Human))
BDBM115071
(2-[3-(5,6-Dimethyl-1H-benzoimidazol-2-yl)-pyridin-...)
Show SMILES Cc1cc2nc([nH]c2cc1C)-c1cccnc1SCC(=O)NCc1ccco1
Show InChI InChI=1S/C21H20N4O2S/c1-13-9-17-18(10-14(13)2)25-20(24-17)16-6-3-7-22-21(16)28-12-19(26)23-11-15-5-4-8-27-15/h3-10H,11-12H2,1-2H3,(H,23,26)(H,24,25)
PCBioAssay
n/an/an/an/a 6.76E+4n/an/an/an/a
The Scripps Research Institute Molecular Screening Center
Curated by PubChem BioAssay
Assay Description
Source (MLPCN Center Name): The Scripps Research Institute Molecular Screening Center Affiliation: UT Southwestern Assay Provider: David Mangelsdorf,...
PubChem Bioassay (2013)
BindingDB Entry DOI: 10.7270/Q2ZP44SP